BDBM27904 8-(2,3-dihydro-1H-inden-5-yl)-N-methoxy-2-({4-[2-(4-methyl-3-oxopiperazin-1-yl)ethyl]phenyl}amino)-5-oxo-5H,8H-pyrido[2,3-d]pyrimidine-6-carboxamide::Pyrido[2,3-d]pyrimidin-5-one, 32
SMILES: CONC(=O)c1cn(-c2ccc3CCCc3c2)c2nc(Nc3ccc(CCN4CCN(C)C(=O)C4)cc3)ncc2c1=O
InChI Key: InChIKey=QANNVIMWUIYCJL-UHFFFAOYSA-N
Data: 1 IC50
Activity Spreadsheet -- Enzyme Inhibition Constant Data from BindingDB
Found 1 hit for monomerid = 27904
Trg + Lig
Ki
nM
ΔG°
kcal/mole
IC50
nM
Kd
nM
EC50/IC50
nM
koff
s-1
kon
M-1s-1
pHTemp
°C
Macrophage colony stimulating factor receptor
(Homo sapiens (Human))
BDBM27904
(8-(2,3-dihydro-1H-inden-5-yl)-N-methoxy-2-({4-[2-(...)
Show SMILES CONC(=O)c1cn(-c2ccc3CCCc3c2)c2nc(Nc3ccc(CCN4CCN(C)C(=O)C4)cc3)ncc2c1=O
Show InChI InChI=1S/C31H33N7O4/c1-36-14-15-37(19-27(36)39)13-12-20-6-9-23(10-7-20)33-31-32-17-25-28(40)26(30(41)35-42-2)18-38(29(25)34-31)24-11-8-21-4-3-5-22(21)16-24/h6-11,16-18H,3-5,12-15,19H2,1-2H3,(H,35,41)(H,32,33,34)
n/an/a 0.800n/an/an/an/a7.522
Johnson & Johnson Pharmaceutical
Assay Description
FMS was assayed using a fluorescence polarization (FP) competition immunoassay that measured FMS phosphorylation of FMS 555-568 peptide at Y561. The ...
J Med Chem 52: 1081-99 (2009)
Article DOI: 10.1021/jm801406h
BindingDB Entry DOI: 10.7270/Q21834T7