BDBM279069 5-(2-ethoxy-3-pyridyl)-1-isopropyl-3-methyl-N-(2-pyridylmethyl)pyrazolo[4,3-b]pyridin-7-amine::US10034861, Example 100::US10512632, Example 100::US10766893, Example S100::US10806718, Example 100
SMILES: CCOc1ncccc1-c1cc(NCc2ccccn2)c2n(nc(C)c2n1)C(C)C
InChI Key: InChIKey=GWMDZOSIIBARTA-UHFFFAOYSA-N
Data: 15 IC50
Activity Spreadsheet -- Enzyme Inhibition Constant Data from BindingDB
Found 15 hits for monomerid = 279069
Trg + Lig
Ki
nM
ΔG°
kcal/mole
IC50
nM
Kd
nM
EC50/IC50
nM
koff
s-1
kon
M-1s-1
pHTemp
°C
Calcium/calmodulin-dependent 3',5'-cyclic nucleotide phosphodiesterase 1A
(Homo sapiens (Human))
BDBM279069
(5-(2-ethoxy-3-pyridyl)-1-isopropyl-3-methyl-N-(2-p...)
Show SMILES CCOc1ncccc1-c1cc(NCc2ccccn2)c2n(nc(C)c2n1)C(C)C
Show InChI InChI=1S/C23H26N6O/c1-5-30-23-18(10-8-12-25-23)19-13-20(26-14-17-9-6-7-11-24-17)22-21(27-19)16(4)28-29(22)15(2)3/h6-13,15H,5,14H2,1-4H3,(H,26,27)
US Patent
n/an/a 6.30n/an/an/an/a7.625
H. Lundbeck A/S
US Patent
Assay Description
PDE1A, PDE1B and PDE1C assays were performed as follows: the assays was performed in 60 μL samples containing a fixed amount of the PDE1 enzyme ...
US Patent US10034861 (2018)
BindingDB Entry DOI: 10.7270/Q2X350HN
Calcium/calmodulin-dependent 3',5'-cyclic nucleotide phosphodiesterase 1C
(Homo sapiens (Human))
BDBM279069
(5-(2-ethoxy-3-pyridyl)-1-isopropyl-3-methyl-N-(2-p...)
Show SMILES CCOc1ncccc1-c1cc(NCc2ccccn2)c2n(nc(C)c2n1)C(C)C
Show InChI InChI=1S/C23H26N6O/c1-5-30-23-18(10-8-12-25-23)19-13-20(26-14-17-9-6-7-11-24-17)22-21(27-19)16(4)28-29(22)15(2)3/h6-13,15H,5,14H2,1-4H3,(H,26,27)
US Patent
n/an/a 21n/an/an/an/an/an/a
H. Lundbeck A/S
US Patent
Assay Description
PDE1A, PDE1B and PDE1C assays were performed as follows: the assays was performed in 60 uL samples containing a fixed amount of the PDE1 enzyme (suff...
US Patent US11026923 (2021)
Calcium/calmodulin-dependent 3',5'-cyclic nucleotide phosphodiesterase 1C
(Homo sapiens (Human))
BDBM279069
(5-(2-ethoxy-3-pyridyl)-1-isopropyl-3-methyl-N-(2-p...)
Show SMILES CCOc1ncccc1-c1cc(NCc2ccccn2)c2n(nc(C)c2n1)C(C)C
Show InChI InChI=1S/C23H26N6O/c1-5-30-23-18(10-8-12-25-23)19-13-20(26-14-17-9-6-7-11-24-17)22-21(27-19)16(4)28-29(22)15(2)3/h6-13,15H,5,14H2,1-4H3,(H,26,27)
US Patent
n/an/a 21n/an/an/an/a7.625
H. Lundbeck A/S
US Patent
Assay Description
PDE1A, PDE1B and PDE1C assays were performed as follows: the assays was performed in 60 μL samples containing a fixed amount of the PDE1 enzyme ...
US Patent US10034861 (2018)
BindingDB Entry DOI: 10.7270/Q2X350HN
Calcium/calmodulin-dependent 3',5'-cyclic phosphodiesterase 1A
(Homo sapiens (Human))
BDBM279069
(5-(2-ethoxy-3-pyridyl)-1-isopropyl-3-methyl-N-(2-p...)
Show SMILES CCOc1ncccc1-c1cc(NCc2ccccn2)c2n(nc(C)c2n1)C(C)C
Show InChI InChI=1S/C23H26N6O/c1-5-30-23-18(10-8-12-25-23)19-13-20(26-14-17-9-6-7-11-24-17)22-21(27-19)16(4)28-29(22)15(2)3/h6-13,15H,5,14H2,1-4H3,(H,26,27)
US Patent
n/an/a 6.30n/an/an/an/an/an/a
H. Lundbeck A/S
US Patent
Assay Description
PDE1A, PDE1B and PDE1C assays were performed as follows: the assays was performed in 60 μL samples containing a fixed amount of the PDE1 enzyme ...
US Patent US10512632 (2019)
BindingDB Entry DOI: 10.7270/Q25T3NVN
Calcium/calmodulin-dependent 3',5'-cyclic nucleotide phosphodiesterase 1B
(Homo sapiens (Human))
BDBM279069
(5-(2-ethoxy-3-pyridyl)-1-isopropyl-3-methyl-N-(2-p...)
Show SMILES CCOc1ncccc1-c1cc(NCc2ccccn2)c2n(nc(C)c2n1)C(C)C
Show InChI InChI=1S/C23H26N6O/c1-5-30-23-18(10-8-12-25-23)19-13-20(26-14-17-9-6-7-11-24-17)22-21(27-19)16(4)28-29(22)15(2)3/h6-13,15H,5,14H2,1-4H3,(H,26,27)
Reactome pathway
US Patent
n/an/a 0.390n/an/an/an/an/an/a
H. Lundbeck A/S
US Patent
Assay Description
PDE1A, PDE1B and PDE1C assays were performed as follows: the assays was performed in 60 μL samples containing a fixed amount of the PDE1 enzyme ...
US Patent US10512632 (2019)
BindingDB Entry DOI: 10.7270/Q25T3NVN
Calcium/calmodulin-dependent 3',5'-cyclic nucleotide phosphodiesterase 1C
(Homo sapiens (Human))
BDBM279069
(5-(2-ethoxy-3-pyridyl)-1-isopropyl-3-methyl-N-(2-p...)
Show SMILES CCOc1ncccc1-c1cc(NCc2ccccn2)c2n(nc(C)c2n1)C(C)C
Show InChI InChI=1S/C23H26N6O/c1-5-30-23-18(10-8-12-25-23)19-13-20(26-14-17-9-6-7-11-24-17)22-21(27-19)16(4)28-29(22)15(2)3/h6-13,15H,5,14H2,1-4H3,(H,26,27)
US Patent
n/an/a 21n/an/an/an/an/an/a
H. Lundbeck A/S
US Patent
Assay Description
PDE1A, PDE1B and PDE1C assays were performed as follows: the assays was performed in 60 μL samples containing a fixed amount of the PDE1 enzyme ...
US Patent US10512632 (2019)
BindingDB Entry DOI: 10.7270/Q25T3NVN
Calcium/calmodulin-dependent 3',5'-cyclic phosphodiesterase 1A
(Homo sapiens (Human))
BDBM279069
(5-(2-ethoxy-3-pyridyl)-1-isopropyl-3-methyl-N-(2-p...)
Show SMILES CCOc1ncccc1-c1cc(NCc2ccccn2)c2n(nc(C)c2n1)C(C)C
Show InChI InChI=1S/C23H26N6O/c1-5-30-23-18(10-8-12-25-23)19-13-20(26-14-17-9-6-7-11-24-17)22-21(27-19)16(4)28-29(22)15(2)3/h6-13,15H,5,14H2,1-4H3,(H,26,27)
US Patent
n/an/a 6.30n/an/an/an/an/an/a
H. Lundbeck A/S
US Patent
Assay Description
PDE1A, PDE1B and PDE1C assays were performed as follows: the assays were performed in 60 μL samples containing a fixed amount of the PDE1 enzyme...
US Patent US10766893 (2020)
Calcium/calmodulin-dependent 3',5'-cyclic nucleotide phosphodiesterase 1B
(Homo sapiens (Human))
BDBM279069
(5-(2-ethoxy-3-pyridyl)-1-isopropyl-3-methyl-N-(2-p...)
Show SMILES CCOc1ncccc1-c1cc(NCc2ccccn2)c2n(nc(C)c2n1)C(C)C
Show InChI InChI=1S/C23H26N6O/c1-5-30-23-18(10-8-12-25-23)19-13-20(26-14-17-9-6-7-11-24-17)22-21(27-19)16(4)28-29(22)15(2)3/h6-13,15H,5,14H2,1-4H3,(H,26,27)
Reactome pathway
US Patent
n/an/a 0.390n/an/an/an/an/an/a
H. Lundbeck A/S
US Patent
Assay Description
PDE1A, PDE1B and PDE1C assays were performed as follows: the assays were performed in 60 μL samples containing a fixed amount of the PDE1 enzyme...
US Patent US10766893 (2020)
Calcium/calmodulin-dependent 3',5'-cyclic nucleotide phosphodiesterase 1C
(Homo sapiens (Human))
BDBM279069
(5-(2-ethoxy-3-pyridyl)-1-isopropyl-3-methyl-N-(2-p...)
Show SMILES CCOc1ncccc1-c1cc(NCc2ccccn2)c2n(nc(C)c2n1)C(C)C
Show InChI InChI=1S/C23H26N6O/c1-5-30-23-18(10-8-12-25-23)19-13-20(26-14-17-9-6-7-11-24-17)22-21(27-19)16(4)28-29(22)15(2)3/h6-13,15H,5,14H2,1-4H3,(H,26,27)
US Patent
n/an/a 21n/an/an/an/an/an/a
H. Lundbeck A/S
US Patent
Assay Description
PDE1A, PDE1B and PDE1C assays were performed as follows: the assays were performed in 60 μL samples containing a fixed amount of the PDE1 enzyme...
US Patent US10766893 (2020)
Calcium/calmodulin-dependent 3',5'-cyclic phosphodiesterase 1A
(Homo sapiens (Human))
BDBM279069
(5-(2-ethoxy-3-pyridyl)-1-isopropyl-3-methyl-N-(2-p...)
Show SMILES CCOc1ncccc1-c1cc(NCc2ccccn2)c2n(nc(C)c2n1)C(C)C
Show InChI InChI=1S/C23H26N6O/c1-5-30-23-18(10-8-12-25-23)19-13-20(26-14-17-9-6-7-11-24-17)22-21(27-19)16(4)28-29(22)15(2)3/h6-13,15H,5,14H2,1-4H3,(H,26,27)
US Patent
n/an/a 6.30n/an/an/an/an/an/a
H. Lundbeck A/S
US Patent
Assay Description
PDE1A, PDE1B and PDE1C assays were performed as follows: the assays was performed in 60 μL samples containing a fixed amount of the PDE1 enzyme ...
US Patent US10806718 (2020)
Calcium/calmodulin-dependent 3',5'-cyclic nucleotide phosphodiesterase 1B
(Homo sapiens (Human))
BDBM279069
(5-(2-ethoxy-3-pyridyl)-1-isopropyl-3-methyl-N-(2-p...)
Show SMILES CCOc1ncccc1-c1cc(NCc2ccccn2)c2n(nc(C)c2n1)C(C)C
Show InChI InChI=1S/C23H26N6O/c1-5-30-23-18(10-8-12-25-23)19-13-20(26-14-17-9-6-7-11-24-17)22-21(27-19)16(4)28-29(22)15(2)3/h6-13,15H,5,14H2,1-4H3,(H,26,27)
Reactome pathway
US Patent
n/an/a 0.390n/an/an/an/an/an/a
H. Lundbeck A/S
US Patent
Assay Description
PDE1A, PDE1B and PDE1C assays were performed as follows: the assays was performed in 60 μL samples containing a fixed amount of the PDE1 enzyme ...
US Patent US10806718 (2020)
Calcium/calmodulin-dependent 3',5'-cyclic nucleotide phosphodiesterase 1C
(Homo sapiens (Human))
BDBM279069
(5-(2-ethoxy-3-pyridyl)-1-isopropyl-3-methyl-N-(2-p...)
Show SMILES CCOc1ncccc1-c1cc(NCc2ccccn2)c2n(nc(C)c2n1)C(C)C
Show InChI InChI=1S/C23H26N6O/c1-5-30-23-18(10-8-12-25-23)19-13-20(26-14-17-9-6-7-11-24-17)22-21(27-19)16(4)28-29(22)15(2)3/h6-13,15H,5,14H2,1-4H3,(H,26,27)
US Patent
n/an/a 21n/an/an/an/an/an/a
H. Lundbeck A/S
US Patent
Assay Description
PDE1A, PDE1B and PDE1C assays were performed as follows: the assays was performed in 60 μL samples containing a fixed amount of the PDE1 enzyme ...
US Patent US10806718 (2020)
Calcium/calmodulin-dependent 3',5'-cyclic phosphodiesterase 1A
(Homo sapiens (Human))
BDBM279069
(5-(2-ethoxy-3-pyridyl)-1-isopropyl-3-methyl-N-(2-p...)
Show SMILES CCOc1ncccc1-c1cc(NCc2ccccn2)c2n(nc(C)c2n1)C(C)C
Show InChI InChI=1S/C23H26N6O/c1-5-30-23-18(10-8-12-25-23)19-13-20(26-14-17-9-6-7-11-24-17)22-21(27-19)16(4)28-29(22)15(2)3/h6-13,15H,5,14H2,1-4H3,(H,26,27)
US Patent
n/an/a 6.30n/an/an/an/an/an/a
H. Lundbeck A/S
US Patent
Assay Description
PDE1A, PDE1B and PDE1C assays were performed as follows: the assays was performed in 60 uL samples containing a fixed amount of the PDE1 enzyme (suff...
US Patent US11026923 (2021)
Calcium/calmodulin-dependent 3',5'-cyclic nucleotide phosphodiesterase 1B
(Homo sapiens (Human))
BDBM279069
(5-(2-ethoxy-3-pyridyl)-1-isopropyl-3-methyl-N-(2-p...)
Show SMILES CCOc1ncccc1-c1cc(NCc2ccccn2)c2n(nc(C)c2n1)C(C)C
Show InChI InChI=1S/C23H26N6O/c1-5-30-23-18(10-8-12-25-23)19-13-20(26-14-17-9-6-7-11-24-17)22-21(27-19)16(4)28-29(22)15(2)3/h6-13,15H,5,14H2,1-4H3,(H,26,27)
Reactome pathway
US Patent
n/an/a 0.390n/an/an/an/an/an/a
H. Lundbeck A/S
US Patent
Assay Description
PDE1A, PDE1B and PDE1C assays were performed as follows: the assays was performed in 60 uL samples containing a fixed amount of the PDE1 enzyme (suff...
US Patent US11026923 (2021)
Phosphodiesterase, PDE1/PDE5
(Homo sapiens (Human))
BDBM279069
(5-(2-ethoxy-3-pyridyl)-1-isopropyl-3-methyl-N-(2-p...)
Show SMILES CCOc1ncccc1-c1cc(NCc2ccccn2)c2n(nc(C)c2n1)C(C)C
Show InChI InChI=1S/C23H26N6O/c1-5-30-23-18(10-8-12-25-23)19-13-20(26-14-17-9-6-7-11-24-17)22-21(27-19)16(4)28-29(22)15(2)3/h6-13,15H,5,14H2,1-4H3,(H,26,27)
Reactome pathway
US Patent
n/an/a 0.390n/an/an/an/a7.625
H. Lundbeck A/S
US Patent
Assay Description
PDE1A, PDE1B and PDE1C assays were performed as follows: the assays was performed in 60 μL samples containing a fixed amount of the PDE1 enzyme ...
US Patent US10034861 (2018)
BindingDB Entry DOI: 10.7270/Q2X350HN