BDBM279075 5-(2-ethoxy-3-pyridyl)-1-isopropyl-N-[(5-methoxy-3-pyridyl)methyl]-3-methyl-pyrazolo[4,3-b]pyridin-7-amine::US10034861, Example 106::US10512632, Example 106::US10766893, Example S106::US10806718, Example 106
SMILES: CCOc1ncccc1-c1cc(NCc2cncc(OC)c2)c2n(nc(C)c2n1)C(C)C
InChI Key: InChIKey=JCOKQWFPIMEUNS-UHFFFAOYSA-N
Data: 15 IC50
Activity Spreadsheet -- Enzyme Inhibition Constant Data from BindingDB
Found 15 hits for monomerid = 279075
Trg + Lig
Ki
nM
ΔG°
kcal/mole
IC50
nM
Kd
nM
EC50/IC50
nM
koff
s-1
kon
M-1s-1
pHTemp
°C
Calcium/calmodulin-dependent 3',5'-cyclic nucleotide phosphodiesterase 1A
(Homo sapiens (Human))
BDBM279075
(5-(2-ethoxy-3-pyridyl)-1-isopropyl-N-[(5-methoxy-3...)
Show SMILES CCOc1ncccc1-c1cc(NCc2cncc(OC)c2)c2n(nc(C)c2n1)C(C)C
Show InChI InChI=1S/C24H28N6O2/c1-6-32-24-19(8-7-9-26-24)20-11-21(27-13-17-10-18(31-5)14-25-12-17)23-22(28-20)16(4)29-30(23)15(2)3/h7-12,14-15H,6,13H2,1-5H3,(H,27,28)
US Patent
n/an/a 2.10n/an/an/an/a7.625
H. Lundbeck A/S
US Patent
Assay Description
PDE1A, PDE1B and PDE1C assays were performed as follows: the assays was performed in 60 μL samples containing a fixed amount of the PDE1 enzyme ...
US Patent US10034861 (2018)
BindingDB Entry DOI: 10.7270/Q2X350HN
Calcium/calmodulin-dependent 3',5'-cyclic nucleotide phosphodiesterase 1C
(Homo sapiens (Human))
BDBM279075
(5-(2-ethoxy-3-pyridyl)-1-isopropyl-N-[(5-methoxy-3...)
Show SMILES CCOc1ncccc1-c1cc(NCc2cncc(OC)c2)c2n(nc(C)c2n1)C(C)C
Show InChI InChI=1S/C24H28N6O2/c1-6-32-24-19(8-7-9-26-24)20-11-21(27-13-17-10-18(31-5)14-25-12-17)23-22(28-20)16(4)29-30(23)15(2)3/h7-12,14-15H,6,13H2,1-5H3,(H,27,28)
US Patent
n/an/a 3.90n/an/an/an/an/an/a
H. Lundbeck A/S
US Patent
Assay Description
PDE1A, PDE1B and PDE1C assays were performed as follows: the assays was performed in 60 uL samples containing a fixed amount of the PDE1 enzyme (suff...
US Patent US11026923 (2021)
Calcium/calmodulin-dependent 3',5'-cyclic nucleotide phosphodiesterase 1C
(Homo sapiens (Human))
BDBM279075
(5-(2-ethoxy-3-pyridyl)-1-isopropyl-N-[(5-methoxy-3...)
Show SMILES CCOc1ncccc1-c1cc(NCc2cncc(OC)c2)c2n(nc(C)c2n1)C(C)C
Show InChI InChI=1S/C24H28N6O2/c1-6-32-24-19(8-7-9-26-24)20-11-21(27-13-17-10-18(31-5)14-25-12-17)23-22(28-20)16(4)29-30(23)15(2)3/h7-12,14-15H,6,13H2,1-5H3,(H,27,28)
US Patent
n/an/a 3.90n/an/an/an/a7.625
H. Lundbeck A/S
US Patent
Assay Description
PDE1A, PDE1B and PDE1C assays were performed as follows: the assays was performed in 60 μL samples containing a fixed amount of the PDE1 enzyme ...
US Patent US10034861 (2018)
BindingDB Entry DOI: 10.7270/Q2X350HN
Calcium/calmodulin-dependent 3',5'-cyclic phosphodiesterase 1A
(Homo sapiens (Human))
BDBM279075
(5-(2-ethoxy-3-pyridyl)-1-isopropyl-N-[(5-methoxy-3...)
Show SMILES CCOc1ncccc1-c1cc(NCc2cncc(OC)c2)c2n(nc(C)c2n1)C(C)C
Show InChI InChI=1S/C24H28N6O2/c1-6-32-24-19(8-7-9-26-24)20-11-21(27-13-17-10-18(31-5)14-25-12-17)23-22(28-20)16(4)29-30(23)15(2)3/h7-12,14-15H,6,13H2,1-5H3,(H,27,28)
US Patent
n/an/a 2.10n/an/an/an/an/an/a
H. Lundbeck A/S
US Patent
Assay Description
PDE1A, PDE1B and PDE1C assays were performed as follows: the assays was performed in 60 μL samples containing a fixed amount of the PDE1 enzyme ...
US Patent US10512632 (2019)
BindingDB Entry DOI: 10.7270/Q25T3NVN
Calcium/calmodulin-dependent 3',5'-cyclic nucleotide phosphodiesterase 1B
(Homo sapiens (Human))
BDBM279075
(5-(2-ethoxy-3-pyridyl)-1-isopropyl-N-[(5-methoxy-3...)
Show SMILES CCOc1ncccc1-c1cc(NCc2cncc(OC)c2)c2n(nc(C)c2n1)C(C)C
Show InChI InChI=1S/C24H28N6O2/c1-6-32-24-19(8-7-9-26-24)20-11-21(27-13-17-10-18(31-5)14-25-12-17)23-22(28-20)16(4)29-30(23)15(2)3/h7-12,14-15H,6,13H2,1-5H3,(H,27,28)
Reactome pathway
US Patent
n/an/a 0.450n/an/an/an/an/an/a
H. Lundbeck A/S
US Patent
Assay Description
PDE1A, PDE1B and PDE1C assays were performed as follows: the assays was performed in 60 μL samples containing a fixed amount of the PDE1 enzyme ...
US Patent US10512632 (2019)
BindingDB Entry DOI: 10.7270/Q25T3NVN
Calcium/calmodulin-dependent 3',5'-cyclic nucleotide phosphodiesterase 1C
(Homo sapiens (Human))
BDBM279075
(5-(2-ethoxy-3-pyridyl)-1-isopropyl-N-[(5-methoxy-3...)
Show SMILES CCOc1ncccc1-c1cc(NCc2cncc(OC)c2)c2n(nc(C)c2n1)C(C)C
Show InChI InChI=1S/C24H28N6O2/c1-6-32-24-19(8-7-9-26-24)20-11-21(27-13-17-10-18(31-5)14-25-12-17)23-22(28-20)16(4)29-30(23)15(2)3/h7-12,14-15H,6,13H2,1-5H3,(H,27,28)
US Patent
n/an/a 3.90n/an/an/an/an/an/a
H. Lundbeck A/S
US Patent
Assay Description
PDE1A, PDE1B and PDE1C assays were performed as follows: the assays was performed in 60 μL samples containing a fixed amount of the PDE1 enzyme ...
US Patent US10512632 (2019)
BindingDB Entry DOI: 10.7270/Q25T3NVN
Calcium/calmodulin-dependent 3',5'-cyclic phosphodiesterase 1A
(Homo sapiens (Human))
BDBM279075
(5-(2-ethoxy-3-pyridyl)-1-isopropyl-N-[(5-methoxy-3...)
Show SMILES CCOc1ncccc1-c1cc(NCc2cncc(OC)c2)c2n(nc(C)c2n1)C(C)C
Show InChI InChI=1S/C24H28N6O2/c1-6-32-24-19(8-7-9-26-24)20-11-21(27-13-17-10-18(31-5)14-25-12-17)23-22(28-20)16(4)29-30(23)15(2)3/h7-12,14-15H,6,13H2,1-5H3,(H,27,28)
US Patent
n/an/a 2.10n/an/an/an/an/an/a
H. Lundbeck A/S
US Patent
Assay Description
PDE1A, PDE1B and PDE1C assays were performed as follows: the assays were performed in 60 μL samples containing a fixed amount of the PDE1 enzyme...
US Patent US10766893 (2020)
Calcium/calmodulin-dependent 3',5'-cyclic nucleotide phosphodiesterase 1B
(Homo sapiens (Human))
BDBM279075
(5-(2-ethoxy-3-pyridyl)-1-isopropyl-N-[(5-methoxy-3...)
Show SMILES CCOc1ncccc1-c1cc(NCc2cncc(OC)c2)c2n(nc(C)c2n1)C(C)C
Show InChI InChI=1S/C24H28N6O2/c1-6-32-24-19(8-7-9-26-24)20-11-21(27-13-17-10-18(31-5)14-25-12-17)23-22(28-20)16(4)29-30(23)15(2)3/h7-12,14-15H,6,13H2,1-5H3,(H,27,28)
Reactome pathway
US Patent
n/an/a 0.450n/an/an/an/an/an/a
H. Lundbeck A/S
US Patent
Assay Description
PDE1A, PDE1B and PDE1C assays were performed as follows: the assays were performed in 60 μL samples containing a fixed amount of the PDE1 enzyme...
US Patent US10766893 (2020)
Calcium/calmodulin-dependent 3',5'-cyclic nucleotide phosphodiesterase 1C
(Homo sapiens (Human))
BDBM279075
(5-(2-ethoxy-3-pyridyl)-1-isopropyl-N-[(5-methoxy-3...)
Show SMILES CCOc1ncccc1-c1cc(NCc2cncc(OC)c2)c2n(nc(C)c2n1)C(C)C
Show InChI InChI=1S/C24H28N6O2/c1-6-32-24-19(8-7-9-26-24)20-11-21(27-13-17-10-18(31-5)14-25-12-17)23-22(28-20)16(4)29-30(23)15(2)3/h7-12,14-15H,6,13H2,1-5H3,(H,27,28)
US Patent
n/an/a 3.90n/an/an/an/an/an/a
H. Lundbeck A/S
US Patent
Assay Description
PDE1A, PDE1B and PDE1C assays were performed as follows: the assays were performed in 60 μL samples containing a fixed amount of the PDE1 enzyme...
US Patent US10766893 (2020)
Calcium/calmodulin-dependent 3',5'-cyclic phosphodiesterase 1A
(Homo sapiens (Human))
BDBM279075
(5-(2-ethoxy-3-pyridyl)-1-isopropyl-N-[(5-methoxy-3...)
Show SMILES CCOc1ncccc1-c1cc(NCc2cncc(OC)c2)c2n(nc(C)c2n1)C(C)C
Show InChI InChI=1S/C24H28N6O2/c1-6-32-24-19(8-7-9-26-24)20-11-21(27-13-17-10-18(31-5)14-25-12-17)23-22(28-20)16(4)29-30(23)15(2)3/h7-12,14-15H,6,13H2,1-5H3,(H,27,28)
US Patent
n/an/a 2.10n/an/an/an/an/an/a
H. Lundbeck A/S
US Patent
Assay Description
PDE1A, PDE1B and PDE1C assays were performed as follows: the assays was performed in 60 μL samples containing a fixed amount of the PDE1 enzyme ...
US Patent US10806718 (2020)
Calcium/calmodulin-dependent 3',5'-cyclic nucleotide phosphodiesterase 1B
(Homo sapiens (Human))
BDBM279075
(5-(2-ethoxy-3-pyridyl)-1-isopropyl-N-[(5-methoxy-3...)
Show SMILES CCOc1ncccc1-c1cc(NCc2cncc(OC)c2)c2n(nc(C)c2n1)C(C)C
Show InChI InChI=1S/C24H28N6O2/c1-6-32-24-19(8-7-9-26-24)20-11-21(27-13-17-10-18(31-5)14-25-12-17)23-22(28-20)16(4)29-30(23)15(2)3/h7-12,14-15H,6,13H2,1-5H3,(H,27,28)
Reactome pathway
US Patent
n/an/a 0.450n/an/an/an/an/an/a
H. Lundbeck A/S
US Patent
Assay Description
PDE1A, PDE1B and PDE1C assays were performed as follows: the assays was performed in 60 μL samples containing a fixed amount of the PDE1 enzyme ...
US Patent US10806718 (2020)
Calcium/calmodulin-dependent 3',5'-cyclic nucleotide phosphodiesterase 1C
(Homo sapiens (Human))
BDBM279075
(5-(2-ethoxy-3-pyridyl)-1-isopropyl-N-[(5-methoxy-3...)
Show SMILES CCOc1ncccc1-c1cc(NCc2cncc(OC)c2)c2n(nc(C)c2n1)C(C)C
Show InChI InChI=1S/C24H28N6O2/c1-6-32-24-19(8-7-9-26-24)20-11-21(27-13-17-10-18(31-5)14-25-12-17)23-22(28-20)16(4)29-30(23)15(2)3/h7-12,14-15H,6,13H2,1-5H3,(H,27,28)
US Patent
n/an/a 3.90n/an/an/an/an/an/a
H. Lundbeck A/S
US Patent
Assay Description
PDE1A, PDE1B and PDE1C assays were performed as follows: the assays was performed in 60 μL samples containing a fixed amount of the PDE1 enzyme ...
US Patent US10806718 (2020)
Calcium/calmodulin-dependent 3',5'-cyclic phosphodiesterase 1A
(Homo sapiens (Human))
BDBM279075
(5-(2-ethoxy-3-pyridyl)-1-isopropyl-N-[(5-methoxy-3...)
Show SMILES CCOc1ncccc1-c1cc(NCc2cncc(OC)c2)c2n(nc(C)c2n1)C(C)C
Show InChI InChI=1S/C24H28N6O2/c1-6-32-24-19(8-7-9-26-24)20-11-21(27-13-17-10-18(31-5)14-25-12-17)23-22(28-20)16(4)29-30(23)15(2)3/h7-12,14-15H,6,13H2,1-5H3,(H,27,28)
US Patent
n/an/a 2.10n/an/an/an/an/an/a
H. Lundbeck A/S
US Patent
Assay Description
PDE1A, PDE1B and PDE1C assays were performed as follows: the assays was performed in 60 uL samples containing a fixed amount of the PDE1 enzyme (suff...
US Patent US11026923 (2021)
Calcium/calmodulin-dependent 3',5'-cyclic nucleotide phosphodiesterase 1B
(Homo sapiens (Human))
BDBM279075
(5-(2-ethoxy-3-pyridyl)-1-isopropyl-N-[(5-methoxy-3...)
Show SMILES CCOc1ncccc1-c1cc(NCc2cncc(OC)c2)c2n(nc(C)c2n1)C(C)C
Show InChI InChI=1S/C24H28N6O2/c1-6-32-24-19(8-7-9-26-24)20-11-21(27-13-17-10-18(31-5)14-25-12-17)23-22(28-20)16(4)29-30(23)15(2)3/h7-12,14-15H,6,13H2,1-5H3,(H,27,28)
Reactome pathway
US Patent
n/an/a 0.450n/an/an/an/an/an/a
H. Lundbeck A/S
US Patent
Assay Description
PDE1A, PDE1B and PDE1C assays were performed as follows: the assays was performed in 60 uL samples containing a fixed amount of the PDE1 enzyme (suff...
US Patent US11026923 (2021)
Phosphodiesterase, PDE1/PDE5
(Homo sapiens (Human))
BDBM279075
(5-(2-ethoxy-3-pyridyl)-1-isopropyl-N-[(5-methoxy-3...)
Show SMILES CCOc1ncccc1-c1cc(NCc2cncc(OC)c2)c2n(nc(C)c2n1)C(C)C
Show InChI InChI=1S/C24H28N6O2/c1-6-32-24-19(8-7-9-26-24)20-11-21(27-13-17-10-18(31-5)14-25-12-17)23-22(28-20)16(4)29-30(23)15(2)3/h7-12,14-15H,6,13H2,1-5H3,(H,27,28)
Reactome pathway
US Patent
n/an/a 0.450n/an/an/an/a7.625
H. Lundbeck A/S
US Patent
Assay Description
PDE1A, PDE1B and PDE1C assays were performed as follows: the assays was performed in 60 μL samples containing a fixed amount of the PDE1 enzyme ...
US Patent US10034861 (2018)
BindingDB Entry DOI: 10.7270/Q2X350HN