null
SMILES: CCOc1ncccc1-c1cc(NCc2ccnc(OC)c2)c2n(nc(C)c2n1)C(C)CC
InChI Key: InChIKey=JRNBIFGQRNWOKC-UHFFFAOYSA-N
Activity Spreadsheet -- Enzyme Inhibition Constant Data from BindingDB
Found 12 hits for monomerid = 279095
Trg + Lig
Ki
nM
ΔG°
kcal/mole
IC50
nM
Kd
nM
EC50/IC50
nM
koff
s-1
kon
M-1s-1
pHTemp
°C
Dual specificity calcium/calmodulin-dependent 3',5'-cyclic nucleotide phosphodiesterase 1A
(Homo sapiens (Human))
BDBM279095
(5-(2-ethoxy-3-pyridyl)-N-[(2-methoxy-4-pyridyl)met...)
Show SMILES CCOc1ncccc1-c1cc(NCc2ccnc(OC)c2)c2n(nc(C)c2n1)C(C)CC
Show InChI InChI=1S/C25H30N6O2/c1-6-16(3)31-24-21(28-15-18-10-12-26-22(13-18)32-5)14-20(29-23(24)17(4)30-31)19-9-8-11-27-25(19)33-7-2/h8-14,16H,6-7,15H2,1-5H3,(H,28,29)
US Patent
n/an/a 5.40n/an/an/an/a7.625
H. Lundbeck A/S
US Patent
Assay Description
PDE1A, PDE1B and PDE1C assays were performed as follows: the assays was performed in 60 μL samples containing a fixed amount of the PDE1 enzyme ...
US Patent US10034861 (2018)
BindingDB Entry DOI: 10.7270/Q2X350HN
Dual specificity calcium/calmodulin-dependent 3',5'-cyclic nucleotide phosphodiesterase 1B
(Homo sapiens (Human))
BDBM279095
(5-(2-ethoxy-3-pyridyl)-N-[(2-methoxy-4-pyridyl)met...)
Show SMILES CCOc1ncccc1-c1cc(NCc2ccnc(OC)c2)c2n(nc(C)c2n1)C(C)CC
Show InChI InChI=1S/C25H30N6O2/c1-6-16(3)31-24-21(28-15-18-10-12-26-22(13-18)32-5)14-20(29-23(24)17(4)30-31)19-9-8-11-27-25(19)33-7-2/h8-14,16H,6-7,15H2,1-5H3,(H,28,29)
Reactome pathway
US Patent
n/an/a 0.510n/an/an/an/a7.625
H. Lundbeck A/S
US Patent
Assay Description
PDE1A, PDE1B and PDE1C assays were performed as follows: the assays was performed in 60 μL samples containing a fixed amount of the PDE1 enzyme ...
US Patent US10034861 (2018)
BindingDB Entry DOI: 10.7270/Q2X350HN
Dual specificity calcium/calmodulin-dependent 3',5'-cyclic nucleotide phosphodiesterase 1C
(Homo sapiens (Human))
BDBM279095
(5-(2-ethoxy-3-pyridyl)-N-[(2-methoxy-4-pyridyl)met...)
Show SMILES CCOc1ncccc1-c1cc(NCc2ccnc(OC)c2)c2n(nc(C)c2n1)C(C)CC
Show InChI InChI=1S/C25H30N6O2/c1-6-16(3)31-24-21(28-15-18-10-12-26-22(13-18)32-5)14-20(29-23(24)17(4)30-31)19-9-8-11-27-25(19)33-7-2/h8-14,16H,6-7,15H2,1-5H3,(H,28,29)
US Patent
n/an/a 8.40n/an/an/an/a7.625
H. Lundbeck A/S
US Patent
Assay Description
PDE1A, PDE1B and PDE1C assays were performed as follows: the assays was performed in 60 μL samples containing a fixed amount of the PDE1 enzyme ...
US Patent US10034861 (2018)
BindingDB Entry DOI: 10.7270/Q2X350HN
Dual specificity calcium/calmodulin-dependent 3',5'-cyclic nucleotide phosphodiesterase 1A
(Homo sapiens (Human))
BDBM279095
(5-(2-ethoxy-3-pyridyl)-N-[(2-methoxy-4-pyridyl)met...)
Show SMILES CCOc1ncccc1-c1cc(NCc2ccnc(OC)c2)c2n(nc(C)c2n1)C(C)CC
Show InChI InChI=1S/C25H30N6O2/c1-6-16(3)31-24-21(28-15-18-10-12-26-22(13-18)32-5)14-20(29-23(24)17(4)30-31)19-9-8-11-27-25(19)33-7-2/h8-14,16H,6-7,15H2,1-5H3,(H,28,29)
US Patent
n/an/a 5.40n/an/an/an/an/an/a
H. Lundbeck A/S
US Patent
Assay Description
PDE1A, PDE1B and PDE1C assays were performed as follows: the assays was performed in 60 μL samples containing a fixed amount of the PDE1 enzyme ...
US Patent US10512632 (2019)
BindingDB Entry DOI: 10.7270/Q25T3NVN
Dual specificity calcium/calmodulin-dependent 3',5'-cyclic nucleotide phosphodiesterase 1B
(Homo sapiens (Human))
BDBM279095
(5-(2-ethoxy-3-pyridyl)-N-[(2-methoxy-4-pyridyl)met...)
Show SMILES CCOc1ncccc1-c1cc(NCc2ccnc(OC)c2)c2n(nc(C)c2n1)C(C)CC
Show InChI InChI=1S/C25H30N6O2/c1-6-16(3)31-24-21(28-15-18-10-12-26-22(13-18)32-5)14-20(29-23(24)17(4)30-31)19-9-8-11-27-25(19)33-7-2/h8-14,16H,6-7,15H2,1-5H3,(H,28,29)
Reactome pathway
US Patent
n/an/a 0.510n/an/an/an/an/an/a
H. Lundbeck A/S
US Patent
Assay Description
PDE1A, PDE1B and PDE1C assays were performed as follows: the assays was performed in 60 μL samples containing a fixed amount of the PDE1 enzyme ...
US Patent US10512632 (2019)
BindingDB Entry DOI: 10.7270/Q25T3NVN
Dual specificity calcium/calmodulin-dependent 3',5'-cyclic nucleotide phosphodiesterase 1C
(Homo sapiens (Human))
BDBM279095
(5-(2-ethoxy-3-pyridyl)-N-[(2-methoxy-4-pyridyl)met...)
Show SMILES CCOc1ncccc1-c1cc(NCc2ccnc(OC)c2)c2n(nc(C)c2n1)C(C)CC
Show InChI InChI=1S/C25H30N6O2/c1-6-16(3)31-24-21(28-15-18-10-12-26-22(13-18)32-5)14-20(29-23(24)17(4)30-31)19-9-8-11-27-25(19)33-7-2/h8-14,16H,6-7,15H2,1-5H3,(H,28,29)
US Patent
n/an/a 8.40n/an/an/an/an/an/a
H. Lundbeck A/S
US Patent
Assay Description
PDE1A, PDE1B and PDE1C assays were performed as follows: the assays was performed in 60 μL samples containing a fixed amount of the PDE1 enzyme ...
US Patent US10806718 (2020)
Dual specificity calcium/calmodulin-dependent 3',5'-cyclic nucleotide phosphodiesterase 1A
(Homo sapiens (Human))
BDBM279095
(5-(2-ethoxy-3-pyridyl)-N-[(2-methoxy-4-pyridyl)met...)
Show SMILES CCOc1ncccc1-c1cc(NCc2ccnc(OC)c2)c2n(nc(C)c2n1)C(C)CC
Show InChI InChI=1S/C25H30N6O2/c1-6-16(3)31-24-21(28-15-18-10-12-26-22(13-18)32-5)14-20(29-23(24)17(4)30-31)19-9-8-11-27-25(19)33-7-2/h8-14,16H,6-7,15H2,1-5H3,(H,28,29)
US Patent
n/an/a 5.40n/an/an/an/an/an/a
H. Lundbeck A/S
US Patent
Assay Description
PDE1A, PDE1B and PDE1C assays were performed as follows: the assays were performed in 60 μL samples containing a fixed amount of the PDE1 enzyme...
US Patent US10766893 (2020)
Dual specificity calcium/calmodulin-dependent 3',5'-cyclic nucleotide phosphodiesterase 1B
(Homo sapiens (Human))
BDBM279095
(5-(2-ethoxy-3-pyridyl)-N-[(2-methoxy-4-pyridyl)met...)
Show SMILES CCOc1ncccc1-c1cc(NCc2ccnc(OC)c2)c2n(nc(C)c2n1)C(C)CC
Show InChI InChI=1S/C25H30N6O2/c1-6-16(3)31-24-21(28-15-18-10-12-26-22(13-18)32-5)14-20(29-23(24)17(4)30-31)19-9-8-11-27-25(19)33-7-2/h8-14,16H,6-7,15H2,1-5H3,(H,28,29)
Reactome pathway
US Patent
n/an/a 0.510n/an/an/an/an/an/a
H. Lundbeck A/S
US Patent
Assay Description
PDE1A, PDE1B and PDE1C assays were performed as follows: the assays were performed in 60 μL samples containing a fixed amount of the PDE1 enzyme...
US Patent US10766893 (2020)
Dual specificity calcium/calmodulin-dependent 3',5'-cyclic nucleotide phosphodiesterase 1C
(Homo sapiens (Human))
BDBM279095
(5-(2-ethoxy-3-pyridyl)-N-[(2-methoxy-4-pyridyl)met...)
Show SMILES CCOc1ncccc1-c1cc(NCc2ccnc(OC)c2)c2n(nc(C)c2n1)C(C)CC
Show InChI InChI=1S/C25H30N6O2/c1-6-16(3)31-24-21(28-15-18-10-12-26-22(13-18)32-5)14-20(29-23(24)17(4)30-31)19-9-8-11-27-25(19)33-7-2/h8-14,16H,6-7,15H2,1-5H3,(H,28,29)
US Patent
n/an/a 8.40n/an/an/an/an/an/a
H. Lundbeck A/S
US Patent
Assay Description
PDE1A, PDE1B and PDE1C assays were performed as follows: the assays were performed in 60 μL samples containing a fixed amount of the PDE1 enzyme...
US Patent US10766893 (2020)
Dual specificity calcium/calmodulin-dependent 3',5'-cyclic nucleotide phosphodiesterase 1A
(Homo sapiens (Human))
BDBM279095
(5-(2-ethoxy-3-pyridyl)-N-[(2-methoxy-4-pyridyl)met...)
Show SMILES CCOc1ncccc1-c1cc(NCc2ccnc(OC)c2)c2n(nc(C)c2n1)C(C)CC
Show InChI InChI=1S/C25H30N6O2/c1-6-16(3)31-24-21(28-15-18-10-12-26-22(13-18)32-5)14-20(29-23(24)17(4)30-31)19-9-8-11-27-25(19)33-7-2/h8-14,16H,6-7,15H2,1-5H3,(H,28,29)
US Patent
n/an/a 5.40n/an/an/an/an/an/a
H. Lundbeck A/S
US Patent
Assay Description
PDE1A, PDE1B and PDE1C assays were performed as follows: the assays was performed in 60 μL samples containing a fixed amount of the PDE1 enzyme ...
US Patent US10806718 (2020)
Dual specificity calcium/calmodulin-dependent 3',5'-cyclic nucleotide phosphodiesterase 1B
(Homo sapiens (Human))
BDBM279095
(5-(2-ethoxy-3-pyridyl)-N-[(2-methoxy-4-pyridyl)met...)
Show SMILES CCOc1ncccc1-c1cc(NCc2ccnc(OC)c2)c2n(nc(C)c2n1)C(C)CC
Show InChI InChI=1S/C25H30N6O2/c1-6-16(3)31-24-21(28-15-18-10-12-26-22(13-18)32-5)14-20(29-23(24)17(4)30-31)19-9-8-11-27-25(19)33-7-2/h8-14,16H,6-7,15H2,1-5H3,(H,28,29)
Reactome pathway
US Patent
n/an/a 0.510n/an/an/an/an/an/a
H. Lundbeck A/S
US Patent
Assay Description
PDE1A, PDE1B and PDE1C assays were performed as follows: the assays was performed in 60 μL samples containing a fixed amount of the PDE1 enzyme ...
US Patent US10806718 (2020)
Dual specificity calcium/calmodulin-dependent 3',5'-cyclic nucleotide phosphodiesterase 1C
(Homo sapiens (Human))
BDBM279095
(5-(2-ethoxy-3-pyridyl)-N-[(2-methoxy-4-pyridyl)met...)
Show SMILES CCOc1ncccc1-c1cc(NCc2ccnc(OC)c2)c2n(nc(C)c2n1)C(C)CC
Show InChI InChI=1S/C25H30N6O2/c1-6-16(3)31-24-21(28-15-18-10-12-26-22(13-18)32-5)14-20(29-23(24)17(4)30-31)19-9-8-11-27-25(19)33-7-2/h8-14,16H,6-7,15H2,1-5H3,(H,28,29)
US Patent
n/an/a 8.40n/an/an/an/an/an/a
H. Lundbeck A/S
US Patent
Assay Description
PDE1A, PDE1B and PDE1C assays were performed as follows: the assays was performed in 60 μL samples containing a fixed amount of the PDE1 enzyme ...
US Patent US10512632 (2019)
BindingDB Entry DOI: 10.7270/Q25T3NVN