BDBM27923 Azabicyclooctane scaffold, 14f::N-[(3aR,6S,6aS)-1-[(2S)-3,3-dimethyl-2-[(2S)-2-(methylamino)propanamido]butanoyl]-octahydrocyclopenta[b]pyrrol-6-yl]naphthalene-2-carboxamide
SMILES: [H][C@]12CC[C@H](NC(=O)c3ccc4ccccc4c3)[C@@]1([H])N(CC2)C(=O)[C@@H](NC(=O)[C@H](C)NC)C(C)(C)C
InChI Key: InChIKey=JFFMYRPQVOGSQN-YBAXTEPTSA-N
Data: 2 KI
Activity Spreadsheet -- Enzyme Inhibition Constant Data from BindingDB
Found 2 hits for monomerid = 27923
Trg + Lig
Ki
nM
ΔG°
kcal/mole
IC50
nM
Kd
nM
EC50/IC50
nM
koff
s-1
kon
M-1s-1
pHTemp
°C
ML-IAP-BIR
(Homo sapiens (Human))
BDBM27923
(Azabicyclooctane scaffold, 14f | N-[(3aR,6S,6aS)-1...)
Show SMILES [H][C@]12CC[C@H](NC(=O)c3ccc4ccccc4c3)[C@@]1([H])N(CC2)C(=O)[C@@H](NC(=O)[C@H](C)NC)C(C)(C)C |r|
Show InChI InChI=1S/C28H38N4O3/c1-17(29-5)25(33)31-24(28(2,3)4)27(35)32-15-14-19-12-13-22(23(19)32)30-26(34)21-11-10-18-8-6-7-9-20(18)16-21/h6-11,16-17,19,22-24,29H,12-15H2,1-5H3,(H,30,34)(H,31,33)/t17-,19+,22-,23-,24+/m0/s1
91 -9.50n/an/an/an/an/a7.222
Genentech, Inc.
Assay Description
Samples for fluorescence polarization affinity measurements were prepared by addition of serial dilutions of target protein to each well containing a...
J Med Chem 52: 1723-30 (2009)
Article DOI: 10.1021/jm801450c
BindingDB Entry DOI: 10.7270/Q2WH2N9H
3D
3D Structure (docked)
XIAP-BIR3
(Homo sapiens (Human))
BDBM27923
(Azabicyclooctane scaffold, 14f | N-[(3aR,6S,6aS)-1...)
Show SMILES [H][C@]12CC[C@H](NC(=O)c3ccc4ccccc4c3)[C@@]1([H])N(CC2)C(=O)[C@@H](NC(=O)[C@H](C)NC)C(C)(C)C |r|
Show InChI InChI=1S/C28H38N4O3/c1-17(29-5)25(33)31-24(28(2,3)4)27(35)32-15-14-19-12-13-22(23(19)32)30-26(34)21-11-10-18-8-6-7-9-20(18)16-21/h6-11,16-17,19,22-24,29H,12-15H2,1-5H3,(H,30,34)(H,31,33)/t17-,19+,22-,23-,24+/m0/s1
Reactome pathway
1.20E+3n/an/an/an/an/an/an/an/a
Genentech, Inc.
Assay Description
Samples for fluorescence polarization affinity measurements were prepared by addition of serial dilutions of target protein to each well containing a...
J Med Chem 52: 1723-30 (2009)
Article DOI: 10.1021/jm801450c
BindingDB Entry DOI: 10.7270/Q2WH2N9H