BDBM27952 2-[5-(4-{4-amino-7,7-dimethyl-7H-pyrimido[4,5-b][1,4]oxazin-6-yl}phenyl)bicyclo[3.2.2]nonan-1-yl]acetic acid::bicyclo[3.2.2]nonane-pyrimido[4,5-b][1,4]oxazine deriv., 6
SMILES: CC1(C)Oc2ncnc(N)c2N=C1c1ccc(cc1)C12CCC(CC(O)=O)(CC1)CCC2
InChI Key: InChIKey=KBONNRAICGHVLX-UHFFFAOYSA-N
Data: 2 IC50
Activity Spreadsheet -- Enzyme Inhibition Constant Data from BindingDB
Found 2 hits for monomerid = 27952
Trg + Lig
Ki
nM
ΔG°
kcal/mole
IC50
nM
Kd
nM
EC50/IC50
nM
koff
s-1
kon
M-1s-1
pHTemp
°C
Sterol O-acyltransferase 1
(Homo sapiens (Human))
BDBM27952
(2-[5-(4-{4-amino-7,7-dimethyl-7H-pyrimido[4,5-b][1...)
Show SMILES CC1(C)Oc2ncnc(N)c2N=C1c1ccc(cc1)C12CCC(CC(O)=O)(CC1)CCC2 |c:12,(7.57,-6.87,;8.39,-5.6,;6.94,-5.51,;7.75,-4.15,;8.66,-2.98,;7.93,-1.62,;8.84,-.35,;10.38,-.44,;11.01,-1.8,;12.55,-1.98,;10.11,-3.07,;10.83,-4.42,;9.93,-5.69,;10.56,-7.05,;12.1,-7.23,;12.83,-8.59,;11.92,-9.86,;10.38,-9.77,;9.75,-8.32,;12.64,-11.22,;13.82,-12.03,;14.09,-13.39,;13.37,-14.66,;13.37,-16.2,;14.73,-16.93,;16,-16.2,;14.73,-18.47,;12.01,-13.94,;11.65,-12.49,;14.82,-13.94,;15.18,-12.4,;14.18,-11.22,)|
Show InChI InChI=1S/C25H30N4O3/c1-23(2)20(29-19-21(26)27-15-28-22(19)32-23)16-4-6-17(7-5-16)25-9-3-8-24(10-12-25,11-13-25)14-18(30)31/h4-7,15H,3,8-14H2,1-2H3,(H,30,31)(H2,26,27,28)
n/an/a 2.80E+4n/an/an/an/a7.437
AstraZeneca
Assay Description
The assay mixture contains test compound, membrane protein, cholesterol solubilized in Triton WR-1339, and glutathione in a 96-deep well plate. The r...
J Med Chem 52: 1558-68 (2009)
Article DOI: 10.1021/jm801507v
BindingDB Entry DOI: 10.7270/Q2N014VR
Diacylglycerol O-acyltransferase 1 (DGAT1)
(Homo sapiens (Human))
BDBM27952
(2-[5-(4-{4-amino-7,7-dimethyl-7H-pyrimido[4,5-b][1...)
Show SMILES CC1(C)Oc2ncnc(N)c2N=C1c1ccc(cc1)C12CCC(CC(O)=O)(CC1)CCC2 |c:12,(7.57,-6.87,;8.39,-5.6,;6.94,-5.51,;7.75,-4.15,;8.66,-2.98,;7.93,-1.62,;8.84,-.35,;10.38,-.44,;11.01,-1.8,;12.55,-1.98,;10.11,-3.07,;10.83,-4.42,;9.93,-5.69,;10.56,-7.05,;12.1,-7.23,;12.83,-8.59,;11.92,-9.86,;10.38,-9.77,;9.75,-8.32,;12.64,-11.22,;13.82,-12.03,;14.09,-13.39,;13.37,-14.66,;13.37,-16.2,;14.73,-16.93,;16,-16.2,;14.73,-18.47,;12.01,-13.94,;11.65,-12.49,;14.82,-13.94,;15.18,-12.4,;14.18,-11.22,)|
Show InChI InChI=1S/C25H30N4O3/c1-23(2)20(29-19-21(26)27-15-28-22(19)32-23)16-4-6-17(7-5-16)25-9-3-8-24(10-12-25,11-13-25)14-18(30)31/h4-7,15H,3,8-14H2,1-2H3,(H,30,31)(H2,26,27,28)
n/an/a 69n/an/an/an/a7.422
AstraZeneca
Assay Description
The assay mixture contains test compound, membrane protein, and 1,2 dioleoyl-sn-glycerol in a 96-deep well plate. The reaction was started by adding ...
J Med Chem 52: 1558-68 (2009)
Article DOI: 10.1021/jm801507v
BindingDB Entry DOI: 10.7270/Q2N014VR