BDBM27961 3-(2-benzyl-1H-1,3-benzodiazol-6-yl)-1-[4-(morpholin-4-yl)cyclohexyl]-1H-pyrazolo[3,4-d]pyrimidin-4-amine::3-(2-benzyl-1H-benzo[d]imidazol-5-yl)-1-((1r,4r)-4-morpholinocyclohexyl)-1H-pyrazolo[3,4-d]pyrimidin-4-amine::3-(2-benzyl-1H-benzo[d]imidazol-6-yl)-1-((trans)-4-morpholinocyclohexyl)-1H-pyrazolo[3,4-d]pyrimidin-4-amine::CHEMBL249496::substituted benzimidazole, 6
SMILES: Nc1ncnc2n(nc(-c3ccc4nc(Cc5ccccc5)[nH]c4c3)c12)[C@H]1CC[C@@H](CC1)N1CCOCC1
InChI Key: InChIKey=MSLPPMUTXCBVLE-HZCBDIJESA-N
Data: 5 IC50
Activity Spreadsheet -- Enzyme Inhibition Constant Data from BindingDB
Found 5 hits for monomerid = 27961
Trg + Lig
Ki
nM
ΔG°
kcal/mole
IC50
nM
Kd
nM
EC50/IC50
nM
koff
s-1
kon
M-1s-1
pHTemp
°C
Insulin-like growth factor I receptor
(Homo sapiens (Human))
BDBM27961
(3-(2-benzyl-1H-1,3-benzodiazol-6-yl)-1-[4-(morphol...)
Show SMILES Nc1ncnc2n(nc(-c3ccc4nc(Cc5ccccc5)[nH]c4c3)c12)[C@H]1CC[C@@H](CC1)N1CCOCC1 |r,wU:29.37,wD:26.30,(-3.15,6.99,;-3.15,5.45,;-4.48,4.68,;-4.48,3.14,;-3.15,2.37,;-1.82,3.14,;-.35,2.66,;.55,3.91,;-.35,5.15,;.12,6.62,;-.85,7.81,;-.31,9.25,;1.21,9.5,;2.04,10.8,;3.53,10.41,;4.72,11.39,;6.16,10.84,;6.16,9.3,;7.49,8.53,;8.83,9.3,;8.83,10.84,;7.49,11.61,;3.62,8.87,;2.19,8.31,;1.64,6.87,;-1.82,4.68,;.42,1.33,;-.41,.03,;.29,-1.34,;1.83,-1.41,;2.66,-.11,;1.96,1.26,;2.6,-2.74,;1.94,-4.13,;2.81,-5.4,;4.35,-5.28,;5.01,-3.89,;4.14,-2.62,)|
Show InChI InChI=1S/C29H32N8O/c30-28-26-27(20-6-11-23-24(17-20)34-25(33-23)16-19-4-2-1-3-5-19)35-37(29(26)32-18-31-28)22-9-7-21(8-10-22)36-12-14-38-15-13-36/h1-6,11,17-18,21-22H,7-10,12-16H2,(H,33,34)(H2,30,31,32)/t21-,22-
Reactome pathway
n/an/a 64n/an/an/an/a7.522
Abbott Laboratories
Assay Description
Assays were performed in 96-well microtiter plates in reaction buffer containing biotinylated substrate, ATP, and purified kinase in the presence of ...
Bioorg Med Chem Lett 19: 1718-21 (2009)
Article DOI: 10.1016/j.bmcl.2009.01.086
BindingDB Entry DOI: 10.7270/Q2CJ8BTG
EGF-R Tyrosine Kinase Mutant (L858R)
(Homo sapiens (Human))
BDBM27961
(3-(2-benzyl-1H-1,3-benzodiazol-6-yl)-1-[4-(morphol...)
Show SMILES Nc1ncnc2n(nc(-c3ccc4nc(Cc5ccccc5)[nH]c4c3)c12)[C@H]1CC[C@@H](CC1)N1CCOCC1 |r,wU:29.37,wD:26.30,(-3.15,6.99,;-3.15,5.45,;-4.48,4.68,;-4.48,3.14,;-3.15,2.37,;-1.82,3.14,;-.35,2.66,;.55,3.91,;-.35,5.15,;.12,6.62,;-.85,7.81,;-.31,9.25,;1.21,9.5,;2.04,10.8,;3.53,10.41,;4.72,11.39,;6.16,10.84,;6.16,9.3,;7.49,8.53,;8.83,9.3,;8.83,10.84,;7.49,11.61,;3.62,8.87,;2.19,8.31,;1.64,6.87,;-1.82,4.68,;.42,1.33,;-.41,.03,;.29,-1.34,;1.83,-1.41,;2.66,-.11,;1.96,1.26,;2.6,-2.74,;1.94,-4.13,;2.81,-5.4,;4.35,-5.28,;5.01,-3.89,;4.14,-2.62,)|
Show InChI InChI=1S/C29H32N8O/c30-28-26-27(20-6-11-23-24(17-20)34-25(33-23)16-19-4-2-1-3-5-19)35-37(29(26)32-18-31-28)22-9-7-21(8-10-22)36-12-14-38-15-13-36/h1-6,11,17-18,21-22H,7-10,12-16H2,(H,33,34)(H2,30,31,32)/t21-,22-
n/an/a 270n/an/an/an/a7.523
Abbott Laboratories
Assay Description
Assays were performed in 96-well microtiter plates in reaction buffer containing biotinylated substrate, ATP, and purified kinase in the presence of ...
Bioorg Med Chem Lett 19: 1718-21 (2009)
Article DOI: 10.1016/j.bmcl.2009.01.086
BindingDB Entry DOI: 10.7270/Q2CJ8BTG
Insulin-like growth factor I receptor
(Homo sapiens (Human))
BDBM27961
(3-(2-benzyl-1H-1,3-benzodiazol-6-yl)-1-[4-(morphol...)
Show SMILES Nc1ncnc2n(nc(-c3ccc4nc(Cc5ccccc5)[nH]c4c3)c12)[C@H]1CC[C@@H](CC1)N1CCOCC1 |r,wU:29.37,wD:26.30,(-3.15,6.99,;-3.15,5.45,;-4.48,4.68,;-4.48,3.14,;-3.15,2.37,;-1.82,3.14,;-.35,2.66,;.55,3.91,;-.35,5.15,;.12,6.62,;-.85,7.81,;-.31,9.25,;1.21,9.5,;2.04,10.8,;3.53,10.41,;4.72,11.39,;6.16,10.84,;6.16,9.3,;7.49,8.53,;8.83,9.3,;8.83,10.84,;7.49,11.61,;3.62,8.87,;2.19,8.31,;1.64,6.87,;-1.82,4.68,;.42,1.33,;-.41,.03,;.29,-1.34,;1.83,-1.41,;2.66,-.11,;1.96,1.26,;2.6,-2.74,;1.94,-4.13,;2.81,-5.4,;4.35,-5.28,;5.01,-3.89,;4.14,-2.62,)|
Show InChI InChI=1S/C29H32N8O/c30-28-26-27(20-6-11-23-24(17-20)34-25(33-23)16-19-4-2-1-3-5-19)35-37(29(26)32-18-31-28)22-9-7-21(8-10-22)36-12-14-38-15-13-36/h1-6,11,17-18,21-22H,7-10,12-16H2,(H,33,34)(H2,30,31,32)/t21-,22-
Reactome pathway
n/an/a 64n/an/an/an/an/an/a
Abbott Laboratories
Curated by ChEMBL
Assay Description
Inhibition of human IGF1R expressed in Sf21 cells by time-resolved fluorescence assay
Bioorg Med Chem Lett 17: 5406-9 (2007)
Article DOI: 10.1016/j.bmcl.2007.07.037
BindingDB Entry DOI: 10.7270/Q20P0ZRZ
Insulin-like growth factor I receptor
(Homo sapiens (Human))
BDBM27961
(3-(2-benzyl-1H-1,3-benzodiazol-6-yl)-1-[4-(morphol...)
Show SMILES Nc1ncnc2n(nc(-c3ccc4nc(Cc5ccccc5)[nH]c4c3)c12)[C@H]1CC[C@@H](CC1)N1CCOCC1 |r,wU:29.37,wD:26.30,(-3.15,6.99,;-3.15,5.45,;-4.48,4.68,;-4.48,3.14,;-3.15,2.37,;-1.82,3.14,;-.35,2.66,;.55,3.91,;-.35,5.15,;.12,6.62,;-.85,7.81,;-.31,9.25,;1.21,9.5,;2.04,10.8,;3.53,10.41,;4.72,11.39,;6.16,10.84,;6.16,9.3,;7.49,8.53,;8.83,9.3,;8.83,10.84,;7.49,11.61,;3.62,8.87,;2.19,8.31,;1.64,6.87,;-1.82,4.68,;.42,1.33,;-.41,.03,;.29,-1.34,;1.83,-1.41,;2.66,-.11,;1.96,1.26,;2.6,-2.74,;1.94,-4.13,;2.81,-5.4,;4.35,-5.28,;5.01,-3.89,;4.14,-2.62,)|
Show InChI InChI=1S/C29H32N8O/c30-28-26-27(20-6-11-23-24(17-20)34-25(33-23)16-19-4-2-1-3-5-19)35-37(29(26)32-18-31-28)22-9-7-21(8-10-22)36-12-14-38-15-13-36/h1-6,11,17-18,21-22H,7-10,12-16H2,(H,33,34)(H2,30,31,32)/t21-,22-
Reactome pathway
n/an/a 94n/an/an/an/an/an/a
Abbott Laboratories
Curated by ChEMBL
Assay Description
Inhibition IGF1R phosphorylation in human MiaPaCa2 cells
Bioorg Med Chem Lett 17: 5406-9 (2007)
Article DOI: 10.1016/j.bmcl.2007.07.037
BindingDB Entry DOI: 10.7270/Q20P0ZRZ
Receptor tyrosine-protein kinase erbB-2
(Homo sapiens (Human))
BDBM27961
(3-(2-benzyl-1H-1,3-benzodiazol-6-yl)-1-[4-(morphol...)
Show SMILES Nc1ncnc2n(nc(-c3ccc4nc(Cc5ccccc5)[nH]c4c3)c12)[C@H]1CC[C@@H](CC1)N1CCOCC1 |r,wU:29.37,wD:26.30,(-3.15,6.99,;-3.15,5.45,;-4.48,4.68,;-4.48,3.14,;-3.15,2.37,;-1.82,3.14,;-.35,2.66,;.55,3.91,;-.35,5.15,;.12,6.62,;-.85,7.81,;-.31,9.25,;1.21,9.5,;2.04,10.8,;3.53,10.41,;4.72,11.39,;6.16,10.84,;6.16,9.3,;7.49,8.53,;8.83,9.3,;8.83,10.84,;7.49,11.61,;3.62,8.87,;2.19,8.31,;1.64,6.87,;-1.82,4.68,;.42,1.33,;-.41,.03,;.29,-1.34,;1.83,-1.41,;2.66,-.11,;1.96,1.26,;2.6,-2.74,;1.94,-4.13,;2.81,-5.4,;4.35,-5.28,;5.01,-3.89,;4.14,-2.62,)|
Show InChI InChI=1S/C29H32N8O/c30-28-26-27(20-6-11-23-24(17-20)34-25(33-23)16-19-4-2-1-3-5-19)35-37(29(26)32-18-31-28)22-9-7-21(8-10-22)36-12-14-38-15-13-36/h1-6,11,17-18,21-22H,7-10,12-16H2,(H,33,34)(H2,30,31,32)/t21-,22-
n/an/a 186n/an/an/an/a7.523
Abbott Laboratories
Assay Description
Assays were performed in 96-well microtiter plates in reaction buffer containing biotinylated substrate, ATP, and purified kinase in the presence of ...
Bioorg Med Chem Lett 19: 1718-21 (2009)
Article DOI: 10.1016/j.bmcl.2009.01.086
BindingDB Entry DOI: 10.7270/Q2CJ8BTG