BDBM27964 3-(2-(2-methoxybenzyl)-1H-benzo[d]imidazol-5-yl)-1-((1r,4r)-4-morpholinocyclohexyl)-1H-pyrazolo[3,4-d]pyrimidin-4-amine::3-(2-(2-methoxybenzyl)-1H-benzo[d]imidazol-6-yl)-1-((trans)-4-morpholinocyclohexyl)-1H-pyrazolo[3,4-d]pyrimidin-4-amine::3-{2-[(2-methoxyphenyl)methyl]-1H-1,3-benzodiazol-6-yl}-1-[4-(morpholin-4-yl)cyclohexyl]-1H-pyrazolo[3,4-d]pyrimidin-4-amine::CHEMBL437584::substituted benzimidazole, 9
SMILES: COc1ccccc1Cc1nc2ccc(cc2[nH]1)-c1nn([C@H]2CC[C@@H](CC2)N2CCOCC2)c2ncnc(N)c12
InChI Key: InChIKey=YETDQFJRLHRQJD-HZCBDIJESA-N
Data: 5 IC50
Activity Spreadsheet -- Enzyme Inhibition Constant Data from BindingDB
Found 5 hits for monomerid = 27964
Trg + Lig
Ki
nM
ΔG°
kcal/mole
IC50
nM
Kd
nM
EC50/IC50
nM
koff
s-1
kon
M-1s-1
pHTemp
°C
Insulin-like growth factor I receptor
(Homo sapiens (Human))
BDBM27964
(3-(2-(2-methoxybenzyl)-1H-benzo[d]imidazol-5-yl)-1...)
Show SMILES COc1ccccc1Cc1nc2ccc(cc2[nH]1)-c1nn([C@H]2CC[C@@H](CC2)N2CCOCC2)c2ncnc(N)c12 |r,wU:24.30,wD:21.23,(8.83,13.92,;7.49,13.15,;7.49,11.61,;8.83,10.84,;8.83,9.3,;7.49,8.53,;6.16,9.3,;6.16,10.84,;4.72,11.39,;3.53,10.41,;2.04,10.8,;1.21,9.5,;-.31,9.25,;-.85,7.81,;.12,6.62,;1.64,6.87,;2.19,8.31,;3.62,8.87,;-.35,5.15,;.55,3.91,;-.35,2.66,;.42,1.33,;-.41,.03,;.29,-1.34,;1.83,-1.41,;2.66,-.11,;1.96,1.26,;2.6,-2.74,;1.94,-4.13,;2.81,-5.4,;4.35,-5.28,;5.01,-3.89,;4.14,-2.62,;-1.82,3.14,;-3.15,2.37,;-4.48,3.14,;-4.48,4.68,;-3.15,5.45,;-3.15,6.99,;-1.82,4.68,)|
Show InChI InChI=1S/C30H34N8O2/c1-39-25-5-3-2-4-19(25)17-26-34-23-11-6-20(16-24(23)35-26)28-27-29(31)32-18-33-30(27)38(36-28)22-9-7-21(8-10-22)37-12-14-40-15-13-37/h2-6,11,16,18,21-22H,7-10,12-15,17H2,1H3,(H,34,35)(H2,31,32,33)/t21-,22-
Reactome pathway
n/an/a 81n/an/an/an/a7.522
Abbott Laboratories
Assay Description
Assays were performed in 96-well microtiter plates in reaction buffer containing biotinylated substrate, ATP, and purified kinase in the presence of ...
Bioorg Med Chem Lett 19: 1718-21 (2009)
Article DOI: 10.1016/j.bmcl.2009.01.086
BindingDB Entry DOI: 10.7270/Q2CJ8BTG
EGF-R Tyrosine Kinase Mutant (L858R)
(Homo sapiens (Human))
BDBM27964
(3-(2-(2-methoxybenzyl)-1H-benzo[d]imidazol-5-yl)-1...)
Show SMILES COc1ccccc1Cc1nc2ccc(cc2[nH]1)-c1nn([C@H]2CC[C@@H](CC2)N2CCOCC2)c2ncnc(N)c12 |r,wU:24.30,wD:21.23,(8.83,13.92,;7.49,13.15,;7.49,11.61,;8.83,10.84,;8.83,9.3,;7.49,8.53,;6.16,9.3,;6.16,10.84,;4.72,11.39,;3.53,10.41,;2.04,10.8,;1.21,9.5,;-.31,9.25,;-.85,7.81,;.12,6.62,;1.64,6.87,;2.19,8.31,;3.62,8.87,;-.35,5.15,;.55,3.91,;-.35,2.66,;.42,1.33,;-.41,.03,;.29,-1.34,;1.83,-1.41,;2.66,-.11,;1.96,1.26,;2.6,-2.74,;1.94,-4.13,;2.81,-5.4,;4.35,-5.28,;5.01,-3.89,;4.14,-2.62,;-1.82,3.14,;-3.15,2.37,;-4.48,3.14,;-4.48,4.68,;-3.15,5.45,;-3.15,6.99,;-1.82,4.68,)|
Show InChI InChI=1S/C30H34N8O2/c1-39-25-5-3-2-4-19(25)17-26-34-23-11-6-20(16-24(23)35-26)28-27-29(31)32-18-33-30(27)38(36-28)22-9-7-21(8-10-22)37-12-14-40-15-13-37/h2-6,11,16,18,21-22H,7-10,12-15,17H2,1H3,(H,34,35)(H2,31,32,33)/t21-,22-
n/an/a 58n/an/an/an/a7.523
Abbott Laboratories
Assay Description
Assays were performed in 96-well microtiter plates in reaction buffer containing biotinylated substrate, ATP, and purified kinase in the presence of ...
Bioorg Med Chem Lett 19: 1718-21 (2009)
Article DOI: 10.1016/j.bmcl.2009.01.086
BindingDB Entry DOI: 10.7270/Q2CJ8BTG
Insulin-like growth factor I receptor
(Homo sapiens (Human))
BDBM27964
(3-(2-(2-methoxybenzyl)-1H-benzo[d]imidazol-5-yl)-1...)
Show SMILES COc1ccccc1Cc1nc2ccc(cc2[nH]1)-c1nn([C@H]2CC[C@@H](CC2)N2CCOCC2)c2ncnc(N)c12 |r,wU:24.30,wD:21.23,(8.83,13.92,;7.49,13.15,;7.49,11.61,;8.83,10.84,;8.83,9.3,;7.49,8.53,;6.16,9.3,;6.16,10.84,;4.72,11.39,;3.53,10.41,;2.04,10.8,;1.21,9.5,;-.31,9.25,;-.85,7.81,;.12,6.62,;1.64,6.87,;2.19,8.31,;3.62,8.87,;-.35,5.15,;.55,3.91,;-.35,2.66,;.42,1.33,;-.41,.03,;.29,-1.34,;1.83,-1.41,;2.66,-.11,;1.96,1.26,;2.6,-2.74,;1.94,-4.13,;2.81,-5.4,;4.35,-5.28,;5.01,-3.89,;4.14,-2.62,;-1.82,3.14,;-3.15,2.37,;-4.48,3.14,;-4.48,4.68,;-3.15,5.45,;-3.15,6.99,;-1.82,4.68,)|
Show InChI InChI=1S/C30H34N8O2/c1-39-25-5-3-2-4-19(25)17-26-34-23-11-6-20(16-24(23)35-26)28-27-29(31)32-18-33-30(27)38(36-28)22-9-7-21(8-10-22)37-12-14-40-15-13-37/h2-6,11,16,18,21-22H,7-10,12-15,17H2,1H3,(H,34,35)(H2,31,32,33)/t21-,22-
Reactome pathway
n/an/a 142n/an/an/an/an/an/a
Abbott Laboratories
Curated by ChEMBL
Assay Description
Inhibition IGF1R phosphorylation in human MiaPaCa2 cells
Bioorg Med Chem Lett 17: 5406-9 (2007)
Article DOI: 10.1016/j.bmcl.2007.07.037
BindingDB Entry DOI: 10.7270/Q20P0ZRZ
Insulin-like growth factor I receptor
(Homo sapiens (Human))
BDBM27964
(3-(2-(2-methoxybenzyl)-1H-benzo[d]imidazol-5-yl)-1...)
Show SMILES COc1ccccc1Cc1nc2ccc(cc2[nH]1)-c1nn([C@H]2CC[C@@H](CC2)N2CCOCC2)c2ncnc(N)c12 |r,wU:24.30,wD:21.23,(8.83,13.92,;7.49,13.15,;7.49,11.61,;8.83,10.84,;8.83,9.3,;7.49,8.53,;6.16,9.3,;6.16,10.84,;4.72,11.39,;3.53,10.41,;2.04,10.8,;1.21,9.5,;-.31,9.25,;-.85,7.81,;.12,6.62,;1.64,6.87,;2.19,8.31,;3.62,8.87,;-.35,5.15,;.55,3.91,;-.35,2.66,;.42,1.33,;-.41,.03,;.29,-1.34,;1.83,-1.41,;2.66,-.11,;1.96,1.26,;2.6,-2.74,;1.94,-4.13,;2.81,-5.4,;4.35,-5.28,;5.01,-3.89,;4.14,-2.62,;-1.82,3.14,;-3.15,2.37,;-4.48,3.14,;-4.48,4.68,;-3.15,5.45,;-3.15,6.99,;-1.82,4.68,)|
Show InChI InChI=1S/C30H34N8O2/c1-39-25-5-3-2-4-19(25)17-26-34-23-11-6-20(16-24(23)35-26)28-27-29(31)32-18-33-30(27)38(36-28)22-9-7-21(8-10-22)37-12-14-40-15-13-37/h2-6,11,16,18,21-22H,7-10,12-15,17H2,1H3,(H,34,35)(H2,31,32,33)/t21-,22-
Reactome pathway
n/an/a 81n/an/an/an/an/an/a
Abbott Laboratories
Curated by ChEMBL
Assay Description
Inhibition of human IGF1R expressed in Sf21 cells by time-resolved fluorescence assay
Bioorg Med Chem Lett 17: 5406-9 (2007)
Article DOI: 10.1016/j.bmcl.2007.07.037
BindingDB Entry DOI: 10.7270/Q20P0ZRZ
Receptor tyrosine-protein kinase erbB-2
(Homo sapiens (Human))
BDBM27964
(3-(2-(2-methoxybenzyl)-1H-benzo[d]imidazol-5-yl)-1...)
Show SMILES COc1ccccc1Cc1nc2ccc(cc2[nH]1)-c1nn([C@H]2CC[C@@H](CC2)N2CCOCC2)c2ncnc(N)c12 |r,wU:24.30,wD:21.23,(8.83,13.92,;7.49,13.15,;7.49,11.61,;8.83,10.84,;8.83,9.3,;7.49,8.53,;6.16,9.3,;6.16,10.84,;4.72,11.39,;3.53,10.41,;2.04,10.8,;1.21,9.5,;-.31,9.25,;-.85,7.81,;.12,6.62,;1.64,6.87,;2.19,8.31,;3.62,8.87,;-.35,5.15,;.55,3.91,;-.35,2.66,;.42,1.33,;-.41,.03,;.29,-1.34,;1.83,-1.41,;2.66,-.11,;1.96,1.26,;2.6,-2.74,;1.94,-4.13,;2.81,-5.4,;4.35,-5.28,;5.01,-3.89,;4.14,-2.62,;-1.82,3.14,;-3.15,2.37,;-4.48,3.14,;-4.48,4.68,;-3.15,5.45,;-3.15,6.99,;-1.82,4.68,)|
Show InChI InChI=1S/C30H34N8O2/c1-39-25-5-3-2-4-19(25)17-26-34-23-11-6-20(16-24(23)35-26)28-27-29(31)32-18-33-30(27)38(36-28)22-9-7-21(8-10-22)37-12-14-40-15-13-37/h2-6,11,16,18,21-22H,7-10,12-15,17H2,1H3,(H,34,35)(H2,31,32,33)/t21-,22-
n/an/a 53n/an/an/an/a7.523
Abbott Laboratories
Assay Description
Assays were performed in 96-well microtiter plates in reaction buffer containing biotinylated substrate, ATP, and purified kinase in the presence of ...
Bioorg Med Chem Lett 19: 1718-21 (2009)
Article DOI: 10.1016/j.bmcl.2009.01.086
BindingDB Entry DOI: 10.7270/Q2CJ8BTG