BDBM27966 1-{4-[4-(4-amino-3-{2-[(2-methoxyphenyl)methyl]-1H-1,3-benzodiazol-6-yl}-1H-pyrazolo[3,4-d]pyrimidin-1-yl)cyclohexyl]piperazin-1-yl}ethan-1-one::substituted pyrazolopyrimidine, 11
SMILES: COc1ccccc1Cc1nc2ccc(cc2[nH]1)-c1nn([C@H]2CC[C@@H](CC2)N2CCN(CC2)C(C)=O)c2ncnc(N)c12
InChI Key: InChIKey=PXOJXTKZVIEYLV-RQNOJGIXSA-N
Data: 3 IC50
Activity Spreadsheet -- Enzyme Inhibition Constant Data from BindingDB
Found 3 hits for monomerid = 27966
Trg + Lig
Ki
nM
ΔG°
kcal/mole
IC50
nM
Kd
nM
EC50/IC50
nM
koff
s-1
kon
M-1s-1
pHTemp
°C
Insulin-like growth factor I receptor
(Homo sapiens (Human))
BDBM27966
(1-{4-[4-(4-amino-3-{2-[(2-methoxyphenyl)methyl]-1H...)
Show SMILES COc1ccccc1Cc1nc2ccc(cc2[nH]1)-c1nn([C@H]2CC[C@@H](CC2)N2CCN(CC2)C(C)=O)c2ncnc(N)c12 |r,wU:24.30,wD:21.23,(8.83,13.92,;7.49,13.15,;7.49,11.61,;8.83,10.84,;8.83,9.3,;7.49,8.53,;6.16,9.3,;6.16,10.84,;4.72,11.39,;3.53,10.41,;2.04,10.8,;1.21,9.5,;-.31,9.25,;-.85,7.81,;.12,6.62,;1.64,6.87,;2.19,8.31,;3.62,8.87,;-.35,5.15,;.55,3.91,;-.35,2.66,;.42,1.33,;-.41,.03,;.29,-1.34,;1.83,-1.41,;2.66,-.11,;1.96,1.26,;2.6,-2.74,;1.94,-4.13,;2.81,-5.4,;4.35,-5.28,;5.01,-3.89,;4.14,-2.62,;5.22,-6.55,;4.55,-7.94,;6.75,-6.43,;-1.82,3.14,;-3.15,2.37,;-4.48,3.14,;-4.48,4.68,;-3.15,5.45,;-3.15,6.99,;-1.82,4.68,)|
Show InChI InChI=1S/C32H37N9O2/c1-20(42)39-13-15-40(16-14-39)23-8-10-24(11-9-23)41-32-29(31(33)34-19-35-32)30(38-41)22-7-12-25-26(17-22)37-28(36-25)18-21-5-3-4-6-27(21)43-2/h3-7,12,17,19,23-24H,8-11,13-16,18H2,1-2H3,(H,36,37)(H2,33,34,35)/t23-,24-
Reactome pathway
n/an/a 27n/an/an/an/a7.522
Abbott Laboratories
Assay Description
Assays were performed in 96-well microtiter plates in reaction buffer containing biotinylated substrate, ATP, and purified kinase in the presence of ...
Bioorg Med Chem Lett 19: 1718-21 (2009)
Article DOI: 10.1016/j.bmcl.2009.01.086
BindingDB Entry DOI: 10.7270/Q2CJ8BTG
Receptor tyrosine-protein kinase erbB-2
(Homo sapiens (Human))
BDBM27966
(1-{4-[4-(4-amino-3-{2-[(2-methoxyphenyl)methyl]-1H...)
Show SMILES COc1ccccc1Cc1nc2ccc(cc2[nH]1)-c1nn([C@H]2CC[C@@H](CC2)N2CCN(CC2)C(C)=O)c2ncnc(N)c12 |r,wU:24.30,wD:21.23,(8.83,13.92,;7.49,13.15,;7.49,11.61,;8.83,10.84,;8.83,9.3,;7.49,8.53,;6.16,9.3,;6.16,10.84,;4.72,11.39,;3.53,10.41,;2.04,10.8,;1.21,9.5,;-.31,9.25,;-.85,7.81,;.12,6.62,;1.64,6.87,;2.19,8.31,;3.62,8.87,;-.35,5.15,;.55,3.91,;-.35,2.66,;.42,1.33,;-.41,.03,;.29,-1.34,;1.83,-1.41,;2.66,-.11,;1.96,1.26,;2.6,-2.74,;1.94,-4.13,;2.81,-5.4,;4.35,-5.28,;5.01,-3.89,;4.14,-2.62,;5.22,-6.55,;4.55,-7.94,;6.75,-6.43,;-1.82,3.14,;-3.15,2.37,;-4.48,3.14,;-4.48,4.68,;-3.15,5.45,;-3.15,6.99,;-1.82,4.68,)|
Show InChI InChI=1S/C32H37N9O2/c1-20(42)39-13-15-40(16-14-39)23-8-10-24(11-9-23)41-32-29(31(33)34-19-35-32)30(38-41)22-7-12-25-26(17-22)37-28(36-25)18-21-5-3-4-6-27(21)43-2/h3-7,12,17,19,23-24H,8-11,13-16,18H2,1-2H3,(H,36,37)(H2,33,34,35)/t23-,24-
n/an/a 59n/an/an/an/a7.523
Abbott Laboratories
Assay Description
Assays were performed in 96-well microtiter plates in reaction buffer containing biotinylated substrate, ATP, and purified kinase in the presence of ...
Bioorg Med Chem Lett 19: 1718-21 (2009)
Article DOI: 10.1016/j.bmcl.2009.01.086
BindingDB Entry DOI: 10.7270/Q2CJ8BTG
EGF-R Tyrosine Kinase Mutant (L858R)
(Homo sapiens (Human))
BDBM27966
(1-{4-[4-(4-amino-3-{2-[(2-methoxyphenyl)methyl]-1H...)
Show SMILES COc1ccccc1Cc1nc2ccc(cc2[nH]1)-c1nn([C@H]2CC[C@@H](CC2)N2CCN(CC2)C(C)=O)c2ncnc(N)c12 |r,wU:24.30,wD:21.23,(8.83,13.92,;7.49,13.15,;7.49,11.61,;8.83,10.84,;8.83,9.3,;7.49,8.53,;6.16,9.3,;6.16,10.84,;4.72,11.39,;3.53,10.41,;2.04,10.8,;1.21,9.5,;-.31,9.25,;-.85,7.81,;.12,6.62,;1.64,6.87,;2.19,8.31,;3.62,8.87,;-.35,5.15,;.55,3.91,;-.35,2.66,;.42,1.33,;-.41,.03,;.29,-1.34,;1.83,-1.41,;2.66,-.11,;1.96,1.26,;2.6,-2.74,;1.94,-4.13,;2.81,-5.4,;4.35,-5.28,;5.01,-3.89,;4.14,-2.62,;5.22,-6.55,;4.55,-7.94,;6.75,-6.43,;-1.82,3.14,;-3.15,2.37,;-4.48,3.14,;-4.48,4.68,;-3.15,5.45,;-3.15,6.99,;-1.82,4.68,)|
Show InChI InChI=1S/C32H37N9O2/c1-20(42)39-13-15-40(16-14-39)23-8-10-24(11-9-23)41-32-29(31(33)34-19-35-32)30(38-41)22-7-12-25-26(17-22)37-28(36-25)18-21-5-3-4-6-27(21)43-2/h3-7,12,17,19,23-24H,8-11,13-16,18H2,1-2H3,(H,36,37)(H2,33,34,35)/t23-,24-
n/an/a 130n/an/an/an/a7.523
Abbott Laboratories
Assay Description
Assays were performed in 96-well microtiter plates in reaction buffer containing biotinylated substrate, ATP, and purified kinase in the presence of ...
Bioorg Med Chem Lett 19: 1718-21 (2009)
Article DOI: 10.1016/j.bmcl.2009.01.086
BindingDB Entry DOI: 10.7270/Q2CJ8BTG