BDBM27977 6-Ethynylthieno[2,3-d]pyrimidine, 12::N-{3-chloro-4-[(3-fluorophenyl)methoxy]phenyl}-6-{2-[(2R)-pyrrolidin-2-yl]ethynyl}thieno[2,3-d]pyrimidin-4-amine
SMILES: Fc1cccc(COc2ccc(Nc3ncnc4sc(cc34)C#C[C@H]3CCCN3)cc2Cl)c1
InChI Key: InChIKey=TWIUFSQIKGYUBP-GOSISDBHSA-N
Data: 3 IC50
Activity Spreadsheet -- Enzyme Inhibition Constant Data from BindingDB
Found 3 hits for monomerid = 27977
Trg + Lig
Ki
nM
ΔG°
kcal/mole
IC50
nM
Kd
nM
EC50/IC50
nM
koff
s-1
kon
M-1s-1
pHTemp
°C
Epidermal growth factor receptor
(Homo sapiens (Human))
BDBM27977
(6-Ethynylthieno[2,3-d]pyrimidine, 12 | N-{3-chloro...)
Show SMILES Fc1cccc(COc2ccc(Nc3ncnc4sc(cc34)C#C[C@H]3CCCN3)cc2Cl)c1 |r|
Show InChI InChI=1S/C25H20ClFN4OS/c26-22-12-19(7-9-23(22)32-14-16-3-1-4-17(27)11-16)31-24-21-13-20(33-25(21)30-15-29-24)8-6-18-5-2-10-28-18/h1,3-4,7,9,11-13,15,18,28H,2,5,10,14H2,(H,29,30,31)/t18-/m1/s1
n/an/a 109n/an/an/an/a7.523
GSK
Assay Description
Assays were performed in 96-well microtiter plates in reaction buffer containing biotinylated substrate, ATP/[gamma-33P]ATP, and purified kinase in t...
Proc Natl Acad Sci U S A 105: 2773-8 (2008)
Article DOI: 10.1073/pnas.0708281105
BindingDB Entry DOI: 10.7270/Q27S7M35
Receptor protein-tyrosine kinase erbB-4
(Homo sapiens (Human))
BDBM27977
(6-Ethynylthieno[2,3-d]pyrimidine, 12 | N-{3-chloro...)
Show SMILES Fc1cccc(COc2ccc(Nc3ncnc4sc(cc34)C#C[C@H]3CCCN3)cc2Cl)c1 |r|
Show InChI InChI=1S/C25H20ClFN4OS/c26-22-12-19(7-9-23(22)32-14-16-3-1-4-17(27)11-16)31-24-21-13-20(33-25(21)30-15-29-24)8-6-18-5-2-10-28-18/h1,3-4,7,9,11-13,15,18,28H,2,5,10,14H2,(H,29,30,31)/t18-/m1/s1
n/an/a 2.30E+3n/an/an/an/a7.523
GSK
Assay Description
Assays were performed in 96-well microtiter plates in reaction buffer containing biotinylated substrate, ATP/[gamma-33P]ATP, and purified kinase in t...
Proc Natl Acad Sci U S A 105: 2773-8 (2008)
Article DOI: 10.1073/pnas.0708281105
BindingDB Entry DOI: 10.7270/Q27S7M35
Receptor tyrosine-protein kinase erbB-2
(Homo sapiens (Human))
BDBM27977
(6-Ethynylthieno[2,3-d]pyrimidine, 12 | N-{3-chloro...)
Show SMILES Fc1cccc(COc2ccc(Nc3ncnc4sc(cc34)C#C[C@H]3CCCN3)cc2Cl)c1 |r|
Show InChI InChI=1S/C25H20ClFN4OS/c26-22-12-19(7-9-23(22)32-14-16-3-1-4-17(27)11-16)31-24-21-13-20(33-25(21)30-15-29-24)8-6-18-5-2-10-28-18/h1,3-4,7,9,11-13,15,18,28H,2,5,10,14H2,(H,29,30,31)/t18-/m1/s1
n/an/a 54n/an/an/an/a7.523
GSK
Assay Description
Assays were performed in 96-well microtiter plates in reaction buffer containing biotinylated substrate, ATP/[gamma-33P]ATP, and purified kinase in t...
Proc Natl Acad Sci U S A 105: 2773-8 (2008)
Article DOI: 10.1073/pnas.0708281105
BindingDB Entry DOI: 10.7270/Q27S7M35