null
SMILES: Nc1cnc(cn1)C#Cc1cc2c(Nc3ccc(OCc4cccc(F)c4)c(Cl)c3)ncnc2s1
InChI Key: InChIKey=WLEIXJUVTKOBDP-UHFFFAOYSA-N
Activity Spreadsheet -- Enzyme Inhibition Constant Data from BindingDB
Found 4 hits for monomerid = 27978
Trg + Lig
Ki
nM
ΔG°
kcal/mole
IC50
nM
Kd
nM
EC50/IC50
nM
koff
s-1
kon
M-1s-1
pHTemp
°C
Epidermal growth factor receptor
(Homo sapiens (Human))
BDBM27978
(5-{2-[4-({3-chloro-4-[(3-fluorophenyl)methoxy]phen...)
Show SMILES Nc1cnc(cn1)C#Cc1cc2c(Nc3ccc(OCc4cccc(F)c4)c(Cl)c3)ncnc2s1
Show InChI InChI=1S/C25H16ClFN6OS/c26-21-9-17(5-7-22(21)34-13-15-2-1-3-16(27)8-15)33-24-20-10-19(35-25(20)32-14-31-24)6-4-18-11-30-23(28)12-29-18/h1-3,5,7-12,14H,13H2,(H2,28,30)(H,31,32,33)
n/an/a 372n/an/an/an/a7.523
GSK
Assay Description
Assays were performed in 96-well microtiter plates in reaction buffer containing biotinylated substrate, ATP/[gamma-33P]ATP, and purified kinase in t...
Proc Natl Acad Sci U S A 105: 2773-8 (2008)
Article DOI: 10.1073/pnas.0708281105
BindingDB Entry DOI: 10.7270/Q27S7M35
Epidermal growth factor receptor
(Homo sapiens (Human))
BDBM27978
(5-{2-[4-({3-chloro-4-[(3-fluorophenyl)methoxy]phen...)
Show SMILES Nc1cnc(cn1)C#Cc1cc2c(Nc3ccc(OCc4cccc(F)c4)c(Cl)c3)ncnc2s1
Show InChI InChI=1S/C25H16ClFN6OS/c26-21-9-17(5-7-22(21)34-13-15-2-1-3-16(27)8-15)33-24-20-10-19(35-25(20)32-14-31-24)6-4-18-11-30-23(28)12-29-18/h1-3,5,7-12,14H,13H2,(H2,28,30)(H,31,32,33)
n/an/a 372n/an/an/an/an/an/a
Norwegian University of Science and Technology
Curated by ChEMBL
Assay Description
Inhibition of EGFR (unknown origin) after 40 mins by scintillation proximity assay
Eur J Med Chem 94: 175-94 (2015)
Article DOI: 10.1016/j.ejmech.2015.03.004
BindingDB Entry DOI: 10.7270/Q2DZ0B04
Receptor tyrosine-protein kinase erbB-4
(Homo sapiens (Human))
BDBM27978
(5-{2-[4-({3-chloro-4-[(3-fluorophenyl)methoxy]phen...)
Show SMILES Nc1cnc(cn1)C#Cc1cc2c(Nc3ccc(OCc4cccc(F)c4)c(Cl)c3)ncnc2s1
Show InChI InChI=1S/C25H16ClFN6OS/c26-21-9-17(5-7-22(21)34-13-15-2-1-3-16(27)8-15)33-24-20-10-19(35-25(20)32-14-31-24)6-4-18-11-30-23(28)12-29-18/h1-3,5,7-12,14H,13H2,(H2,28,30)(H,31,32,33)
n/an/a 1.35E+3n/an/an/an/a7.523
GSK
Assay Description
Assays were performed in 96-well microtiter plates in reaction buffer containing biotinylated substrate, ATP/[gamma-33P]ATP, and purified kinase in t...
Proc Natl Acad Sci U S A 105: 2773-8 (2008)
Article DOI: 10.1073/pnas.0708281105
BindingDB Entry DOI: 10.7270/Q27S7M35
Receptor tyrosine-protein kinase erbB-2
(Homo sapiens (Human))
BDBM27978
(5-{2-[4-({3-chloro-4-[(3-fluorophenyl)methoxy]phen...)
Show SMILES Nc1cnc(cn1)C#Cc1cc2c(Nc3ccc(OCc4cccc(F)c4)c(Cl)c3)ncnc2s1
Show InChI InChI=1S/C25H16ClFN6OS/c26-21-9-17(5-7-22(21)34-13-15-2-1-3-16(27)8-15)33-24-20-10-19(35-25(20)32-14-31-24)6-4-18-11-30-23(28)12-29-18/h1-3,5,7-12,14H,13H2,(H2,28,30)(H,31,32,33)
n/an/a 52n/an/an/an/a7.523
GSK
Assay Description
Assays were performed in 96-well microtiter plates in reaction buffer containing biotinylated substrate, ATP/[gamma-33P]ATP, and purified kinase in t...
Proc Natl Acad Sci U S A 105: 2773-8 (2008)
Article DOI: 10.1073/pnas.0708281105
BindingDB Entry DOI: 10.7270/Q27S7M35