BDBM279952 US10028961, Compound 105::US10172864, Compound 105::US10946023, Compound 105
SMILES: CC(F)(F)c1cccc(n1)-c1nc(NC2CCC(F)(F)C2)nc(NC2CCC(F)(F)C2)n1
InChI Key: InChIKey=RZUPVAWGQZNFEZ-UHFFFAOYSA-N
Data: 15 IC50
Activity Spreadsheet -- Enzyme Inhibition Constant Data from BindingDB
Found 15 hits for monomerid = 279952
Trg + Lig
Ki
nM
ΔG°
kcal/mole
IC50
nM
Kd
nM
EC50/IC50
nM
koff
s-1
kon
M-1s-1
pHTemp
°C
IDH1 R132H
(Homo sapiens (Human))
BDBM279952
(US10028961, Compound 105 | US10172864, Compound 10...)
Show SMILES CC(F)(F)c1cccc(n1)-c1nc(NC2CCC(F)(F)C2)nc(NC2CCC(F)(F)C2)n1
Show InChI InChI=1S/C20H22F6N6/c1-18(21,22)14-4-2-3-13(29-14)15-30-16(27-11-5-7-19(23,24)9-11)32-17(31-15)28-12-6-8-20(25,26)10-12/h2-4,11-12H,5-10H2,1H3,(H2,27,28,30,31,32)
US Patent
n/an/a<50n/an/an/an/a6.525
Agios Pharmaceuticals, Inc.
US Patent
Assay Description
In the primary reaction, the reduction of α-KG acid to 2-HG is accompanied by a concomitant oxidation of NADPH to NADP. The amount of NADPH rema...
US Patent US10028961 (2018)
BindingDB Entry DOI: 10.7270/Q2ZW1NXM
IDH1 R132H
(Homo sapiens (Human))
BDBM279952
(US10028961, Compound 105 | US10172864, Compound 10...)
Show SMILES CC(F)(F)c1cccc(n1)-c1nc(NC2CCC(F)(F)C2)nc(NC2CCC(F)(F)C2)n1
Show InChI InChI=1S/C20H22F6N6/c1-18(21,22)14-4-2-3-13(29-14)15-30-16(27-11-5-7-19(23,24)9-11)32-17(31-15)28-12-6-8-20(25,26)10-12/h2-4,11-12H,5-10H2,1H3,(H2,27,28,30,31,32)
US Patent
n/an/a<50n/an/an/an/an/an/a
Agios Pharmaceuticals, Inc.
US Patent
Assay Description
A test compound is prepared as 10 mM stock in DMSO and diluted to 50× final concentration in DMSO, for a 50 μl reaction mixture. IDH enzyme acti...
US Patent US10946023 (2021)
IDH2(R140Q)
(Homo sapiens (Human))
BDBM279952
(US10028961, Compound 105 | US10172864, Compound 10...)
Show SMILES CC(F)(F)c1cccc(n1)-c1nc(NC2CCC(F)(F)C2)nc(NC2CCC(F)(F)C2)n1
Show InChI InChI=1S/C20H22F6N6/c1-18(21,22)14-4-2-3-13(29-14)15-30-16(27-11-5-7-19(23,24)9-11)32-17(31-15)28-12-6-8-20(25,26)10-12/h2-4,11-12H,5-10H2,1H3,(H2,27,28,30,31,32)
US Patent
n/an/a<50n/an/an/an/a7.525
Agios Pharmaceuticals, Inc.
US Patent
Assay Description
Compounds are assayed for IDH2 R140Q inhibitory activity through a cofactor depletion assay. Compounds are preincubated with enzyme, then the reactio...
US Patent US10028961 (2018)
BindingDB Entry DOI: 10.7270/Q2ZW1NXM
IDH1 R132H
(Homo sapiens (Human))
BDBM279952
(US10028961, Compound 105 | US10172864, Compound 10...)
Show SMILES CC(F)(F)c1cccc(n1)-c1nc(NC2CCC(F)(F)C2)nc(NC2CCC(F)(F)C2)n1
Show InChI InChI=1S/C20H22F6N6/c1-18(21,22)14-4-2-3-13(29-14)15-30-16(27-11-5-7-19(23,24)9-11)32-17(31-15)28-12-6-8-20(25,26)10-12/h2-4,11-12H,5-10H2,1H3,(H2,27,28,30,31,32)
US Patent
n/an/a<50n/an/an/an/a7.525
Agios Pharmaceuticals, Inc.
US Patent
Assay Description
A test compound is prepared as 10 mM stock in DMSO and diluted to 50× final concentration in DMSO, for a 50 μl reaction mixture. IDH enzyme acti...
US Patent US10028961 (2018)
BindingDB Entry DOI: 10.7270/Q2ZW1NXM
IDH1 R132H
(Homo sapiens (Human))
BDBM279952
(US10028961, Compound 105 | US10172864, Compound 10...)
Show SMILES CC(F)(F)c1cccc(n1)-c1nc(NC2CCC(F)(F)C2)nc(NC2CCC(F)(F)C2)n1
Show InChI InChI=1S/C20H22F6N6/c1-18(21,22)14-4-2-3-13(29-14)15-30-16(27-11-5-7-19(23,24)9-11)32-17(31-15)28-12-6-8-20(25,26)10-12/h2-4,11-12H,5-10H2,1H3,(H2,27,28,30,31,32)
US Patent
n/an/a<50n/an/an/an/an/an/a
Agios Pharmaceuticals, Inc.
US Patent
Assay Description
In the primary reaction, the reduction of α-KG acid to 2-HG is accompanied by a concomitant oxidation of NADPH to NADP. The amount of NADPH rema...
US Patent US10172864 (2019)
BindingDB Entry DOI: 10.7270/Q2ZK5JQ3
IDH1 R132H
(Homo sapiens (Human))
BDBM279952
(US10028961, Compound 105 | US10172864, Compound 10...)
Show SMILES CC(F)(F)c1cccc(n1)-c1nc(NC2CCC(F)(F)C2)nc(NC2CCC(F)(F)C2)n1
Show InChI InChI=1S/C20H22F6N6/c1-18(21,22)14-4-2-3-13(29-14)15-30-16(27-11-5-7-19(23,24)9-11)32-17(31-15)28-12-6-8-20(25,26)10-12/h2-4,11-12H,5-10H2,1H3,(H2,27,28,30,31,32)
US Patent
n/an/a<50n/an/an/an/an/an/a
Agios Pharmaceuticals, Inc.
US Patent
Assay Description
In the primary reaction, the reduction of α-KG acid to 2-HG is accompanied by a concomitant oxidation of NADPH to NADP. The amount of NADPH rema...
US Patent US10172864 (2019)
BindingDB Entry DOI: 10.7270/Q2ZK5JQ3
IDH2(R140Q)
(Homo sapiens (Human))
BDBM279952
(US10028961, Compound 105 | US10172864, Compound 10...)
Show SMILES CC(F)(F)c1cccc(n1)-c1nc(NC2CCC(F)(F)C2)nc(NC2CCC(F)(F)C2)n1
Show InChI InChI=1S/C20H22F6N6/c1-18(21,22)14-4-2-3-13(29-14)15-30-16(27-11-5-7-19(23,24)9-11)32-17(31-15)28-12-6-8-20(25,26)10-12/h2-4,11-12H,5-10H2,1H3,(H2,27,28,30,31,32)
US Patent
n/an/a<50n/an/an/an/an/an/a
Agios Pharmaceuticals, Inc.
US Patent
Assay Description
Compounds are assayed for IDH2 R140Q inhibitory activity through a cofactor depletion assay. Compounds are preincubated with enzyme, then the reactio...
US Patent US10172864 (2019)
BindingDB Entry DOI: 10.7270/Q2ZK5JQ3
IDH1 R132H
(Homo sapiens (Human))
BDBM279952
(US10028961, Compound 105 | US10172864, Compound 10...)
Show SMILES CC(F)(F)c1cccc(n1)-c1nc(NC2CCC(F)(F)C2)nc(NC2CCC(F)(F)C2)n1
Show InChI InChI=1S/C20H22F6N6/c1-18(21,22)14-4-2-3-13(29-14)15-30-16(27-11-5-7-19(23,24)9-11)32-17(31-15)28-12-6-8-20(25,26)10-12/h2-4,11-12H,5-10H2,1H3,(H2,27,28,30,31,32)
US Patent
n/an/a<50n/an/an/an/an/an/a
Agios Pharmaceuticals, Inc.
US Patent
Assay Description
A test compound is prepared as 10 mM stock in DMSO and diluted to 50× final concentration in DMSO, for a 50 μl reaction mixture. IDH enzyme acti...
US Patent US10172864 (2019)
BindingDB Entry DOI: 10.7270/Q2ZK5JQ3
Isocitrate dehydrogenase 2 (IDH2)
(Homo sapiens (Human))
BDBM279952
(US10028961, Compound 105 | US10172864, Compound 10...)
Show SMILES CC(F)(F)c1cccc(n1)-c1nc(NC2CCC(F)(F)C2)nc(NC2CCC(F)(F)C2)n1
Show InChI InChI=1S/C20H22F6N6/c1-18(21,22)14-4-2-3-13(29-14)15-30-16(27-11-5-7-19(23,24)9-11)32-17(31-15)28-12-6-8-20(25,26)10-12/h2-4,11-12H,5-10H2,1H3,(H2,27,28,30,31,32)
n/an/a<50n/an/an/an/an/an/a
China Pharmaceutical University
Curated by ChEMBL
Assay Description
Inhibition of IDH2 R140Q mutant (unknown origin) assessed as reduction in NADPH consumption using alpha-KG as substrate incubated for 60 mins by by d...
J Med Chem 61: 8981-9003 (2018)
Article DOI: 10.1021/acs.jmedchem.8b00159
Isocitrate dehydrogenase [NADP] cytoplasmic
(Homo sapiens (Human))
BDBM279952
(US10028961, Compound 105 | US10172864, Compound 10...)
Show SMILES CC(F)(F)c1cccc(n1)-c1nc(NC2CCC(F)(F)C2)nc(NC2CCC(F)(F)C2)n1
Show InChI InChI=1S/C20H22F6N6/c1-18(21,22)14-4-2-3-13(29-14)15-30-16(27-11-5-7-19(23,24)9-11)32-17(31-15)28-12-6-8-20(25,26)10-12/h2-4,11-12H,5-10H2,1H3,(H2,27,28,30,31,32)
n/an/a<50n/an/an/an/an/an/a
China Pharmaceutical University
Curated by ChEMBL
Assay Description
Inhibition of IDH1 R132C mutant (unknown origin) assessed as reduction in NADPH consumption using alpha-KG as substrate incubated for 60 mins by by d...
J Med Chem 61: 8981-9003 (2018)
Article DOI: 10.1021/acs.jmedchem.8b00159
Isocitrate dehydrogenase [NADP] cytoplasmic
(Homo sapiens (Human))
BDBM279952
(US10028961, Compound 105 | US10172864, Compound 10...)
Show SMILES CC(F)(F)c1cccc(n1)-c1nc(NC2CCC(F)(F)C2)nc(NC2CCC(F)(F)C2)n1
Show InChI InChI=1S/C20H22F6N6/c1-18(21,22)14-4-2-3-13(29-14)15-30-16(27-11-5-7-19(23,24)9-11)32-17(31-15)28-12-6-8-20(25,26)10-12/h2-4,11-12H,5-10H2,1H3,(H2,27,28,30,31,32)
n/an/a<50n/an/an/an/an/an/a
China Pharmaceutical University
Curated by ChEMBL
Assay Description
Inhibition of IDH1 R132H mutant (unknown origin) assessed as reduction in NADPH consumption using alpha-KG as substrate incubated for 60 mins by by d...
J Med Chem 61: 8981-9003 (2018)
Article DOI: 10.1021/acs.jmedchem.8b00159
IDH1 WT/IDH1 R132H
(Homo sapiens (Human))
BDBM279952
(US10028961, Compound 105 | US10172864, Compound 10...)
Show SMILES CC(F)(F)c1cccc(n1)-c1nc(NC2CCC(F)(F)C2)nc(NC2CCC(F)(F)C2)n1
Show InChI InChI=1S/C20H22F6N6/c1-18(21,22)14-4-2-3-13(29-14)15-30-16(27-11-5-7-19(23,24)9-11)32-17(31-15)28-12-6-8-20(25,26)10-12/h2-4,11-12H,5-10H2,1H3,(H2,27,28,30,31,32)
US Patent
n/an/a<50n/an/an/an/an/an/a
Agios Pharmaceuticals, Inc.
US Patent
Assay Description
In the primary reaction, the reduction of α-KG acid to 2-HG is accompanied by a concomitant oxidation of NADPH to NADP. The amount of NADPH rema...
US Patent US10946023 (2021)
IDH1 WT/IDH1 R132C
(Homo sapiens (Human))
BDBM279952
(US10028961, Compound 105 | US10172864, Compound 10...)
Show SMILES CC(F)(F)c1cccc(n1)-c1nc(NC2CCC(F)(F)C2)nc(NC2CCC(F)(F)C2)n1
Show InChI InChI=1S/C20H22F6N6/c1-18(21,22)14-4-2-3-13(29-14)15-30-16(27-11-5-7-19(23,24)9-11)32-17(31-15)28-12-6-8-20(25,26)10-12/h2-4,11-12H,5-10H2,1H3,(H2,27,28,30,31,32)
US Patent
n/an/a<50n/an/an/an/an/an/a
Agios Pharmaceuticals, Inc.
US Patent
Assay Description
In the primary reaction, the reduction of α-KG acid to 2-HG is accompanied by a concomitant oxidation of NADPH to NADP. The amount of NADPH rema...
US Patent US10946023 (2021)
IDH2(R140Q)
(Homo sapiens (Human))
BDBM279952
(US10028961, Compound 105 | US10172864, Compound 10...)
Show SMILES CC(F)(F)c1cccc(n1)-c1nc(NC2CCC(F)(F)C2)nc(NC2CCC(F)(F)C2)n1
Show InChI InChI=1S/C20H22F6N6/c1-18(21,22)14-4-2-3-13(29-14)15-30-16(27-11-5-7-19(23,24)9-11)32-17(31-15)28-12-6-8-20(25,26)10-12/h2-4,11-12H,5-10H2,1H3,(H2,27,28,30,31,32)
US Patent
n/an/a<50n/an/an/an/an/an/a
Agios Pharmaceuticals, Inc.
US Patent
Assay Description
Compounds are assayed for IDH2 R140Q inhibitory activity through a cofactor depletion assay. Compounds are preincubated with enzyme, then the reactio...
US Patent US10946023 (2021)
IDH1 R132C
(Homo sapiens (Human))
BDBM279952
(US10028961, Compound 105 | US10172864, Compound 10...)
Show SMILES CC(F)(F)c1cccc(n1)-c1nc(NC2CCC(F)(F)C2)nc(NC2CCC(F)(F)C2)n1
Show InChI InChI=1S/C20H22F6N6/c1-18(21,22)14-4-2-3-13(29-14)15-30-16(27-11-5-7-19(23,24)9-11)32-17(31-15)28-12-6-8-20(25,26)10-12/h2-4,11-12H,5-10H2,1H3,(H2,27,28,30,31,32)
US Patent
n/an/a<50n/an/an/an/a6.525
Agios Pharmaceuticals, Inc.
US Patent
Assay Description
In the primary reaction, the reduction of α-KG acid to 2-HG is accompanied by a concomitant oxidation of NADPH to NADP. The amount of NADPH rema...
US Patent US10028961 (2018)
BindingDB Entry DOI: 10.7270/Q2ZW1NXM