BDBM279999 US10028961, Compound 152::US10172864, Compound 152::US10946023, Compound 152
SMILES: FC(F)(F)c1cccc(n1)-c1nc(NC2CCC(F)(F)C2)nc(NC2Cc3ccccc3C2)n1
InChI Key: InChIKey=WFJGUJXRROVRQM-UHFFFAOYSA-N
Data: 12 IC50
Activity Spreadsheet -- Enzyme Inhibition Constant Data from BindingDB
Found 12 hits for monomerid = 279999
Trg + Lig
Ki
nM
ΔG°
kcal/mole
IC50
nM
Kd
nM
EC50/IC50
nM
koff
s-1
kon
M-1s-1
pHTemp
°C
IDH1 R132H
(Homo sapiens (Human))
BDBM279999
(US10028961, Compound 152 | US10172864, Compound 15...)
Show SMILES FC(F)(F)c1cccc(n1)-c1nc(NC2CCC(F)(F)C2)nc(NC2Cc3ccccc3C2)n1
Show InChI InChI=1S/C23H21F5N6/c24-22(25)9-8-15(12-22)29-20-32-19(17-6-3-7-18(31-17)23(26,27)28)33-21(34-20)30-16-10-13-4-1-2-5-14(13)11-16/h1-7,15-16H,8-12H2,(H2,29,30,32,33,34)
US Patent
n/an/a<50n/an/an/an/a6.525
Agios Pharmaceuticals, Inc.
US Patent
Assay Description
In the primary reaction, the reduction of α-KG acid to 2-HG is accompanied by a concomitant oxidation of NADPH to NADP. The amount of NADPH rema...
US Patent US10028961 (2018)
BindingDB Entry DOI: 10.7270/Q2ZW1NXM
IDH1 R132C
(Homo sapiens (Human))
BDBM279999
(US10028961, Compound 152 | US10172864, Compound 15...)
Show SMILES FC(F)(F)c1cccc(n1)-c1nc(NC2CCC(F)(F)C2)nc(NC2Cc3ccccc3C2)n1
Show InChI InChI=1S/C23H21F5N6/c24-22(25)9-8-15(12-22)29-20-32-19(17-6-3-7-18(31-17)23(26,27)28)33-21(34-20)30-16-10-13-4-1-2-5-14(13)11-16/h1-7,15-16H,8-12H2,(H2,29,30,32,33,34)
US Patent
n/an/a<50n/an/an/an/a6.525
Agios Pharmaceuticals, Inc.
US Patent
Assay Description
In the primary reaction, the reduction of α-KG acid to 2-HG is accompanied by a concomitant oxidation of NADPH to NADP. The amount of NADPH rema...
US Patent US10028961 (2018)
BindingDB Entry DOI: 10.7270/Q2ZW1NXM
IDH2(R140Q)
(Homo sapiens (Human))
BDBM279999
(US10028961, Compound 152 | US10172864, Compound 15...)
Show SMILES FC(F)(F)c1cccc(n1)-c1nc(NC2CCC(F)(F)C2)nc(NC2Cc3ccccc3C2)n1
Show InChI InChI=1S/C23H21F5N6/c24-22(25)9-8-15(12-22)29-20-32-19(17-6-3-7-18(31-17)23(26,27)28)33-21(34-20)30-16-10-13-4-1-2-5-14(13)11-16/h1-7,15-16H,8-12H2,(H2,29,30,32,33,34)
US Patent
n/an/a<50n/an/an/an/a7.525
Agios Pharmaceuticals, Inc.
US Patent
Assay Description
Compounds are assayed for IDH2 R140Q inhibitory activity through a cofactor depletion assay. Compounds are preincubated with enzyme, then the reactio...
US Patent US10028961 (2018)
BindingDB Entry DOI: 10.7270/Q2ZW1NXM
IDH1 R132H
(Homo sapiens (Human))
BDBM279999
(US10028961, Compound 152 | US10172864, Compound 15...)
Show SMILES FC(F)(F)c1cccc(n1)-c1nc(NC2CCC(F)(F)C2)nc(NC2Cc3ccccc3C2)n1
Show InChI InChI=1S/C23H21F5N6/c24-22(25)9-8-15(12-22)29-20-32-19(17-6-3-7-18(31-17)23(26,27)28)33-21(34-20)30-16-10-13-4-1-2-5-14(13)11-16/h1-7,15-16H,8-12H2,(H2,29,30,32,33,34)
US Patent
n/an/a<50n/an/an/an/a7.525
Agios Pharmaceuticals, Inc.
US Patent
Assay Description
A test compound is prepared as 10 mM stock in DMSO and diluted to 50× final concentration in DMSO, for a 50 μl reaction mixture. IDH enzyme acti...
US Patent US10028961 (2018)
BindingDB Entry DOI: 10.7270/Q2ZW1NXM
IDH1 R132H
(Homo sapiens (Human))
BDBM279999
(US10028961, Compound 152 | US10172864, Compound 15...)
Show SMILES FC(F)(F)c1cccc(n1)-c1nc(NC2CCC(F)(F)C2)nc(NC2Cc3ccccc3C2)n1
Show InChI InChI=1S/C23H21F5N6/c24-22(25)9-8-15(12-22)29-20-32-19(17-6-3-7-18(31-17)23(26,27)28)33-21(34-20)30-16-10-13-4-1-2-5-14(13)11-16/h1-7,15-16H,8-12H2,(H2,29,30,32,33,34)
US Patent
n/an/a<50n/an/an/an/an/an/a
Agios Pharmaceuticals, Inc.
US Patent
Assay Description
In the primary reaction, the reduction of α-KG acid to 2-HG is accompanied by a concomitant oxidation of NADPH to NADP. The amount of NADPH rema...
US Patent US10172864 (2019)
BindingDB Entry DOI: 10.7270/Q2ZK5JQ3
IDH2(R140Q)
(Homo sapiens (Human))
BDBM279999
(US10028961, Compound 152 | US10172864, Compound 15...)
Show SMILES FC(F)(F)c1cccc(n1)-c1nc(NC2CCC(F)(F)C2)nc(NC2Cc3ccccc3C2)n1
Show InChI InChI=1S/C23H21F5N6/c24-22(25)9-8-15(12-22)29-20-32-19(17-6-3-7-18(31-17)23(26,27)28)33-21(34-20)30-16-10-13-4-1-2-5-14(13)11-16/h1-7,15-16H,8-12H2,(H2,29,30,32,33,34)
US Patent
n/an/a<50n/an/an/an/an/an/a
Agios Pharmaceuticals, Inc.
US Patent
Assay Description
Compounds are assayed for IDH2 R140Q inhibitory activity through a cofactor depletion assay. Compounds are preincubated with enzyme, then the reactio...
US Patent US10946023 (2021)
IDH2(R140Q)
(Homo sapiens (Human))
BDBM279999
(US10028961, Compound 152 | US10172864, Compound 15...)
Show SMILES FC(F)(F)c1cccc(n1)-c1nc(NC2CCC(F)(F)C2)nc(NC2Cc3ccccc3C2)n1
Show InChI InChI=1S/C23H21F5N6/c24-22(25)9-8-15(12-22)29-20-32-19(17-6-3-7-18(31-17)23(26,27)28)33-21(34-20)30-16-10-13-4-1-2-5-14(13)11-16/h1-7,15-16H,8-12H2,(H2,29,30,32,33,34)
US Patent
n/an/a<50n/an/an/an/an/an/a
Agios Pharmaceuticals, Inc.
US Patent
Assay Description
Compounds are assayed for IDH2 R140Q inhibitory activity through a cofactor depletion assay. Compounds are preincubated with enzyme, then the reactio...
US Patent US10172864 (2019)
BindingDB Entry DOI: 10.7270/Q2ZK5JQ3
IDH1 R132H
(Homo sapiens (Human))
BDBM279999
(US10028961, Compound 152 | US10172864, Compound 15...)
Show SMILES FC(F)(F)c1cccc(n1)-c1nc(NC2CCC(F)(F)C2)nc(NC2Cc3ccccc3C2)n1
Show InChI InChI=1S/C23H21F5N6/c24-22(25)9-8-15(12-22)29-20-32-19(17-6-3-7-18(31-17)23(26,27)28)33-21(34-20)30-16-10-13-4-1-2-5-14(13)11-16/h1-7,15-16H,8-12H2,(H2,29,30,32,33,34)
US Patent
n/an/a<50n/an/an/an/an/an/a
Agios Pharmaceuticals, Inc.
US Patent
Assay Description
A test compound is prepared as 10 mM stock in DMSO and diluted to 50× final concentration in DMSO, for a 50 μl reaction mixture. IDH enzyme acti...
US Patent US10172864 (2019)
BindingDB Entry DOI: 10.7270/Q2ZK5JQ3
IDH1 R132H
(Homo sapiens (Human))
BDBM279999
(US10028961, Compound 152 | US10172864, Compound 15...)
Show SMILES FC(F)(F)c1cccc(n1)-c1nc(NC2CCC(F)(F)C2)nc(NC2Cc3ccccc3C2)n1
Show InChI InChI=1S/C23H21F5N6/c24-22(25)9-8-15(12-22)29-20-32-19(17-6-3-7-18(31-17)23(26,27)28)33-21(34-20)30-16-10-13-4-1-2-5-14(13)11-16/h1-7,15-16H,8-12H2,(H2,29,30,32,33,34)
US Patent
n/an/a<50n/an/an/an/an/an/a
Agios Pharmaceuticals, Inc.
US Patent
Assay Description
A test compound is prepared as 10 mM stock in DMSO and diluted to 50× final concentration in DMSO, for a 50 μl reaction mixture. IDH enzyme acti...
US Patent US10946023 (2021)
IDH1 WT/IDH1 R132H
(Homo sapiens (Human))
BDBM279999
(US10028961, Compound 152 | US10172864, Compound 15...)
Show SMILES FC(F)(F)c1cccc(n1)-c1nc(NC2CCC(F)(F)C2)nc(NC2Cc3ccccc3C2)n1
Show InChI InChI=1S/C23H21F5N6/c24-22(25)9-8-15(12-22)29-20-32-19(17-6-3-7-18(31-17)23(26,27)28)33-21(34-20)30-16-10-13-4-1-2-5-14(13)11-16/h1-7,15-16H,8-12H2,(H2,29,30,32,33,34)
US Patent
n/an/a<50n/an/an/an/an/an/a
Agios Pharmaceuticals, Inc.
US Patent
Assay Description
In the primary reaction, the reduction of α-KG acid to 2-HG is accompanied by a concomitant oxidation of NADPH to NADP. The amount of NADPH rema...
US Patent US10946023 (2021)
IDH1 WT/IDH1 R132C
(Homo sapiens (Human))
BDBM279999
(US10028961, Compound 152 | US10172864, Compound 15...)
Show SMILES FC(F)(F)c1cccc(n1)-c1nc(NC2CCC(F)(F)C2)nc(NC2Cc3ccccc3C2)n1
Show InChI InChI=1S/C23H21F5N6/c24-22(25)9-8-15(12-22)29-20-32-19(17-6-3-7-18(31-17)23(26,27)28)33-21(34-20)30-16-10-13-4-1-2-5-14(13)11-16/h1-7,15-16H,8-12H2,(H2,29,30,32,33,34)
US Patent
n/an/a<50n/an/an/an/an/an/a
Agios Pharmaceuticals, Inc.
US Patent
Assay Description
In the primary reaction, the reduction of α-KG acid to 2-HG is accompanied by a concomitant oxidation of NADPH to NADP. The amount of NADPH rema...
US Patent US10946023 (2021)
IDH1 R132H
(Homo sapiens (Human))
BDBM279999
(US10028961, Compound 152 | US10172864, Compound 15...)
Show SMILES FC(F)(F)c1cccc(n1)-c1nc(NC2CCC(F)(F)C2)nc(NC2Cc3ccccc3C2)n1
Show InChI InChI=1S/C23H21F5N6/c24-22(25)9-8-15(12-22)29-20-32-19(17-6-3-7-18(31-17)23(26,27)28)33-21(34-20)30-16-10-13-4-1-2-5-14(13)11-16/h1-7,15-16H,8-12H2,(H2,29,30,32,33,34)
US Patent
n/an/a<50n/an/an/an/an/an/a
Agios Pharmaceuticals, Inc.
US Patent
Assay Description
In the primary reaction, the reduction of α-KG acid to 2-HG is accompanied by a concomitant oxidation of NADPH to NADP. The amount of NADPH rema...
US Patent US10172864 (2019)
BindingDB Entry DOI: 10.7270/Q2ZK5JQ3