BDBM280368 2-(5-chloro-2-fluorophenyl)-5-(prop-1-en-2-yl)-N-[3-(pyrrolidine-1-carbonyl)pyridin-4-yl]pyridin-4-amine::US10030004, Compound 34::US10501436, Compound 34
SMILES: CC(=C)c1cnc(cc1Nc1ccncc1C(=O)N1CCCC1)-c1cc(Cl)ccc1F
InChI Key: InChIKey=FHRZBVSUXBSDPP-UHFFFAOYSA-N
Data: 12 IC50
Activity Spreadsheet -- Enzyme Inhibition Constant Data from BindingDB
Found 18 hits for monomerid = 280368
Trg + Lig
Ki
nM
ΔG°
kcal/mole
IC50
nM
Kd
nM
EC50/IC50
nM
koff
s-1
kon
M-1s-1
pHTemp
°C
Serine/threonine-protein kinase receptor R3
(Homo sapiens (Human))
BDBM280368
(2-(5-chloro-2-fluorophenyl)-5-(prop-1-en-2-yl)-N-[...)
Show SMILES CC(=C)c1cnc(cc1Nc1ccncc1C(=O)N1CCCC1)-c1cc(Cl)ccc1F
Show InChI InChI=1S/C24H22ClFN4O/c1-15(2)18-14-28-22(17-11-16(25)5-6-20(17)26)12-23(18)29-21-7-8-27-13-19(21)24(31)30-9-3-4-10-30/h5-8,11-14H,1,3-4,9-10H2,2H3,(H,27,28,29)
US Patent
n/an/a>1.00E+4n/an/an/an/an/an/a
Medivation Technologies LLC
US Patent
Assay Description
Compound of the invention were screened in an in vitro kinase assay against several members of the TGFβ family of Ser/Thr kinases. The kinases t...
US Patent US10030004 (2018)
BindingDB Entry DOI: 10.7270/Q2QC05HQ
Bone morphogenetic protein 10
(Homo sapiens (Human))
BDBM280368
(2-(5-chloro-2-fluorophenyl)-5-(prop-1-en-2-yl)-N-[...)
Show SMILES CC(=C)c1cnc(cc1Nc1ccncc1C(=O)N1CCCC1)-c1cc(Cl)ccc1F
Show InChI InChI=1S/C24H22ClFN4O/c1-15(2)18-14-28-22(17-11-16(25)5-6-20(17)26)12-23(18)29-21-7-8-27-13-19(21)24(31)30-9-3-4-10-30/h5-8,11-14H,1,3-4,9-10H2,2H3,(H,27,28,29)
n/an/a>1.00E+4n/an/an/an/an/an/a
TBA
Citation and Details
Activin receptor-like kinase 3 (ALK-3)
(Homo sapiens (Human))
BDBM280368
(2-(5-chloro-2-fluorophenyl)-5-(prop-1-en-2-yl)-N-[...)
Show SMILES CC(=C)c1cnc(cc1Nc1ccncc1C(=O)N1CCCC1)-c1cc(Cl)ccc1F
Show InChI InChI=1S/C24H22ClFN4O/c1-15(2)18-14-28-22(17-11-16(25)5-6-20(17)26)12-23(18)29-21-7-8-27-13-19(21)24(31)30-9-3-4-10-30/h5-8,11-14H,1,3-4,9-10H2,2H3,(H,27,28,29)
US Patent
n/an/a>1.00E+4n/an/an/an/an/an/a
Medivation Technologies LLC
US Patent
Assay Description
Compound of the invention were screened in an in vitro kinase assay against several members of the TGFβ family of Ser/Thr kinases. The kinases t...
US Patent US10030004 (2018)
BindingDB Entry DOI: 10.7270/Q2QC05HQ
Activin receptor type-1B
(Homo sapiens (Human))
BDBM280368
(2-(5-chloro-2-fluorophenyl)-5-(prop-1-en-2-yl)-N-[...)
Show SMILES CC(=C)c1cnc(cc1Nc1ccncc1C(=O)N1CCCC1)-c1cc(Cl)ccc1F
Show InChI InChI=1S/C24H22ClFN4O/c1-15(2)18-14-28-22(17-11-16(25)5-6-20(17)26)12-23(18)29-21-7-8-27-13-19(21)24(31)30-9-3-4-10-30/h5-8,11-14H,1,3-4,9-10H2,2H3,(H,27,28,29)
Reactome pathway
US Patent
n/an/a 149n/an/an/an/an/an/a
Medivation Technologies LLC
US Patent
Assay Description
Compound of the invention were screened in an in vitro kinase assay against several members of the TGFβ family of Ser/Thr kinases. The kinases t...
US Patent US10030004 (2018)
BindingDB Entry DOI: 10.7270/Q2QC05HQ
TGF-beta receptor type-1
(Homo sapiens (Human))
BDBM280368
(2-(5-chloro-2-fluorophenyl)-5-(prop-1-en-2-yl)-N-[...)
Show SMILES CC(=C)c1cnc(cc1Nc1ccncc1C(=O)N1CCCC1)-c1cc(Cl)ccc1F
Show InChI InChI=1S/C24H22ClFN4O/c1-15(2)18-14-28-22(17-11-16(25)5-6-20(17)26)12-23(18)29-21-7-8-27-13-19(21)24(31)30-9-3-4-10-30/h5-8,11-14H,1,3-4,9-10H2,2H3,(H,27,28,29)
US Patent
n/an/a 77.3n/an/an/an/an/an/a
Medivation Technologies LLC
US Patent
Assay Description
Compound of the invention were screened in an in vitro kinase assay against several members of the TGFβ family of Ser/Thr kinases. The kinases t...
US Patent US10030004 (2018)
BindingDB Entry DOI: 10.7270/Q2QC05HQ
Bone morphogenetic protein receptor type-1B
(Mus musculus (Mouse))
BDBM280368
(2-(5-chloro-2-fluorophenyl)-5-(prop-1-en-2-yl)-N-[...)
Show SMILES CC(=C)c1cnc(cc1Nc1ccncc1C(=O)N1CCCC1)-c1cc(Cl)ccc1F
Show InChI InChI=1S/C24H22ClFN4O/c1-15(2)18-14-28-22(17-11-16(25)5-6-20(17)26)12-23(18)29-21-7-8-27-13-19(21)24(31)30-9-3-4-10-30/h5-8,11-14H,1,3-4,9-10H2,2H3,(H,27,28,29)
US Patent
n/an/a>1.00E+4n/an/an/an/an/an/a
Medivation Technologies LLC
US Patent
Assay Description
Compound of the invention were screened in an in vitro kinase assay against several members of the TGFβ family of Ser/Thr kinases. The kinases t...
US Patent US10030004 (2018)
BindingDB Entry DOI: 10.7270/Q2QC05HQ
Serine/threonine-protein kinase receptor R3
(Homo sapiens (Human))
BDBM280368
(2-(5-chloro-2-fluorophenyl)-5-(prop-1-en-2-yl)-N-[...)
Show SMILES CC(=C)c1cnc(cc1Nc1ccncc1C(=O)N1CCCC1)-c1cc(Cl)ccc1F
Show InChI InChI=1S/C24H22ClFN4O/c1-15(2)18-14-28-22(17-11-16(25)5-6-20(17)26)12-23(18)29-21-7-8-27-13-19(21)24(31)30-9-3-4-10-30/h5-8,11-14H,1,3-4,9-10H2,2H3,(H,27,28,29)
US Patent
n/an/a>1.00E+4n/an/an/an/an/an/a
Medivation Technologies LLC
US Patent
Assay Description
Compound of the invention were screened in an in vitro kinase assay against several members of the TGFβ family of Ser/Thr kinases. The kinases t...
US Patent US10501436 (2019)
BindingDB Entry DOI: 10.7270/Q20867PH
Activin receptor type-1
(Homo sapiens (Human))
BDBM280368
(2-(5-chloro-2-fluorophenyl)-5-(prop-1-en-2-yl)-N-[...)
Show SMILES CC(=C)c1cnc(cc1Nc1ccncc1C(=O)N1CCCC1)-c1cc(Cl)ccc1F
Show InChI InChI=1S/C24H22ClFN4O/c1-15(2)18-14-28-22(17-11-16(25)5-6-20(17)26)12-23(18)29-21-7-8-27-13-19(21)24(31)30-9-3-4-10-30/h5-8,11-14H,1,3-4,9-10H2,2H3,(H,27,28,29)
US Patent
n/an/a>1.00E+4n/an/an/an/an/an/a
Medivation Technologies LLC
US Patent
Assay Description
Compound of the invention were screened in an in vitro kinase assay against several members of the TGFβ family of Ser/Thr kinases. The kinases t...
US Patent US10501436 (2019)
BindingDB Entry DOI: 10.7270/Q20867PH
Activin receptor-like kinase 3 (ALK-3)
(Homo sapiens (Human))
BDBM280368
(2-(5-chloro-2-fluorophenyl)-5-(prop-1-en-2-yl)-N-[...)
Show SMILES CC(=C)c1cnc(cc1Nc1ccncc1C(=O)N1CCCC1)-c1cc(Cl)ccc1F
Show InChI InChI=1S/C24H22ClFN4O/c1-15(2)18-14-28-22(17-11-16(25)5-6-20(17)26)12-23(18)29-21-7-8-27-13-19(21)24(31)30-9-3-4-10-30/h5-8,11-14H,1,3-4,9-10H2,2H3,(H,27,28,29)
US Patent
n/an/a>1.00E+4n/an/an/an/an/an/a
Medivation Technologies LLC
US Patent
Assay Description
Compound of the invention were screened in an in vitro kinase assay against several members of the TGFβ family of Ser/Thr kinases. The kinases t...
US Patent US10501436 (2019)
BindingDB Entry DOI: 10.7270/Q20867PH
Activin receptor type-1B
(Homo sapiens (Human))
BDBM280368
(2-(5-chloro-2-fluorophenyl)-5-(prop-1-en-2-yl)-N-[...)
Show SMILES CC(=C)c1cnc(cc1Nc1ccncc1C(=O)N1CCCC1)-c1cc(Cl)ccc1F
Show InChI InChI=1S/C24H22ClFN4O/c1-15(2)18-14-28-22(17-11-16(25)5-6-20(17)26)12-23(18)29-21-7-8-27-13-19(21)24(31)30-9-3-4-10-30/h5-8,11-14H,1,3-4,9-10H2,2H3,(H,27,28,29)
Reactome pathway
US Patent
n/an/a 149n/an/an/an/an/an/a
Medivation Technologies LLC
US Patent
Assay Description
Compound of the invention were screened in an in vitro kinase assay against several members of the TGFβ family of Ser/Thr kinases. The kinases t...
US Patent US10501436 (2019)
BindingDB Entry DOI: 10.7270/Q20867PH
TGF-beta receptor type-1
(Homo sapiens (Human))
BDBM280368
(2-(5-chloro-2-fluorophenyl)-5-(prop-1-en-2-yl)-N-[...)
Show SMILES CC(=C)c1cnc(cc1Nc1ccncc1C(=O)N1CCCC1)-c1cc(Cl)ccc1F
Show InChI InChI=1S/C24H22ClFN4O/c1-15(2)18-14-28-22(17-11-16(25)5-6-20(17)26)12-23(18)29-21-7-8-27-13-19(21)24(31)30-9-3-4-10-30/h5-8,11-14H,1,3-4,9-10H2,2H3,(H,27,28,29)
US Patent
n/an/a 77.3n/an/an/an/an/an/a
Medivation Technologies LLC
US Patent
Assay Description
Compound of the invention were screened in an in vitro kinase assay against several members of the TGFβ family of Ser/Thr kinases. The kinases t...
US Patent US10501436 (2019)
BindingDB Entry DOI: 10.7270/Q20867PH
Bone morphogenetic protein receptor type-1B
(Homo sapiens (Human))
BDBM280368
(2-(5-chloro-2-fluorophenyl)-5-(prop-1-en-2-yl)-N-[...)
Show SMILES CC(=C)c1cnc(cc1Nc1ccncc1C(=O)N1CCCC1)-c1cc(Cl)ccc1F
Show InChI InChI=1S/C24H22ClFN4O/c1-15(2)18-14-28-22(17-11-16(25)5-6-20(17)26)12-23(18)29-21-7-8-27-13-19(21)24(31)30-9-3-4-10-30/h5-8,11-14H,1,3-4,9-10H2,2H3,(H,27,28,29)
US Patent
n/an/a>1.00E+4n/an/an/an/an/an/a
Medivation Technologies LLC
US Patent
Assay Description
Compound of the invention were screened in an in vitro kinase assay against several members of the TGFβ family of Ser/Thr kinases. The kinases t...
US Patent US10501436 (2019)
BindingDB Entry DOI: 10.7270/Q20867PH
Serine/threonine-protein kinase receptor R3
(Homo sapiens (Human))
BDBM280368
(2-(5-chloro-2-fluorophenyl)-5-(prop-1-en-2-yl)-N-[...)
Show SMILES CC(=C)c1cnc(cc1Nc1ccncc1C(=O)N1CCCC1)-c1cc(Cl)ccc1F
Show InChI InChI=1S/C24H22ClFN4O/c1-15(2)18-14-28-22(17-11-16(25)5-6-20(17)26)12-23(18)29-21-7-8-27-13-19(21)24(31)30-9-3-4-10-30/h5-8,11-14H,1,3-4,9-10H2,2H3,(H,27,28,29)
n/an/a>1.00E+4n/an/an/an/an/an/a
TBA
Citation and Details
Activin receptor type-1
(Homo sapiens (Human))
BDBM280368
(2-(5-chloro-2-fluorophenyl)-5-(prop-1-en-2-yl)-N-[...)
Show SMILES CC(=C)c1cnc(cc1Nc1ccncc1C(=O)N1CCCC1)-c1cc(Cl)ccc1F
Show InChI InChI=1S/C24H22ClFN4O/c1-15(2)18-14-28-22(17-11-16(25)5-6-20(17)26)12-23(18)29-21-7-8-27-13-19(21)24(31)30-9-3-4-10-30/h5-8,11-14H,1,3-4,9-10H2,2H3,(H,27,28,29)
n/an/a>1.00E+4n/an/an/an/an/an/a
TBA
Citation and Details
Activin receptor-like kinase 3 (ALK-3)
(Homo sapiens (Human))
BDBM280368
(2-(5-chloro-2-fluorophenyl)-5-(prop-1-en-2-yl)-N-[...)
Show SMILES CC(=C)c1cnc(cc1Nc1ccncc1C(=O)N1CCCC1)-c1cc(Cl)ccc1F
Show InChI InChI=1S/C24H22ClFN4O/c1-15(2)18-14-28-22(17-11-16(25)5-6-20(17)26)12-23(18)29-21-7-8-27-13-19(21)24(31)30-9-3-4-10-30/h5-8,11-14H,1,3-4,9-10H2,2H3,(H,27,28,29)
n/an/a>1.00E+4n/an/an/an/an/an/a
TBA
Citation and Details
Activin receptor type-1B
(Homo sapiens (Human))
BDBM280368
(2-(5-chloro-2-fluorophenyl)-5-(prop-1-en-2-yl)-N-[...)
Show SMILES CC(=C)c1cnc(cc1Nc1ccncc1C(=O)N1CCCC1)-c1cc(Cl)ccc1F
Show InChI InChI=1S/C24H22ClFN4O/c1-15(2)18-14-28-22(17-11-16(25)5-6-20(17)26)12-23(18)29-21-7-8-27-13-19(21)24(31)30-9-3-4-10-30/h5-8,11-14H,1,3-4,9-10H2,2H3,(H,27,28,29)
Reactome pathway
n/an/a 149n/an/an/an/an/an/a
TBA
Citation and Details
TGF-beta receptor type-1
(Homo sapiens (Human))
BDBM280368
(2-(5-chloro-2-fluorophenyl)-5-(prop-1-en-2-yl)-N-[...)
Show SMILES CC(=C)c1cnc(cc1Nc1ccncc1C(=O)N1CCCC1)-c1cc(Cl)ccc1F
Show InChI InChI=1S/C24H22ClFN4O/c1-15(2)18-14-28-22(17-11-16(25)5-6-20(17)26)12-23(18)29-21-7-8-27-13-19(21)24(31)30-9-3-4-10-30/h5-8,11-14H,1,3-4,9-10H2,2H3,(H,27,28,29)
n/an/a 77.3n/an/an/an/an/an/a
TBA
Citation and Details
Activin receptor type-1
(Homo sapiens (Human))
BDBM280368
(2-(5-chloro-2-fluorophenyl)-5-(prop-1-en-2-yl)-N-[...)
Show SMILES CC(=C)c1cnc(cc1Nc1ccncc1C(=O)N1CCCC1)-c1cc(Cl)ccc1F
Show InChI InChI=1S/C24H22ClFN4O/c1-15(2)18-14-28-22(17-11-16(25)5-6-20(17)26)12-23(18)29-21-7-8-27-13-19(21)24(31)30-9-3-4-10-30/h5-8,11-14H,1,3-4,9-10H2,2H3,(H,27,28,29)
US Patent
n/an/a>1.00E+4n/an/an/an/an/an/a
Medivation Technologies LLC
US Patent
Assay Description
Compound of the invention were screened in an in vitro kinase assay against several members of the TGFβ family of Ser/Thr kinases. The kinases t...
US Patent US10030004 (2018)
BindingDB Entry DOI: 10.7270/Q2QC05HQ