BDBM280370 2-(5-chloro-2-fluorophenyl)-5-(propan-2-yl)-N-{1H-pyrazolo[3,4-d]pyrimidin-4-yl}pyridin-4-amine::US10030004, Compound 36::US10501436, Compound 36
SMILES: COc1ccc(Cn2ncc3c(Nc4cc(ncc4C(C)C)-c4cc(Cl)ccc4F)ncnc23)cc1
InChI Key: InChIKey=CKODUGCWZCWIRZ-UHFFFAOYSA-N
Data: 12 IC50
Activity Spreadsheet -- Enzyme Inhibition Constant Data from BindingDB
Found 18 hits for monomerid = 280370
Trg + Lig
Ki
nM
ΔG°
kcal/mole
IC50
nM
Kd
nM
EC50/IC50
nM
koff
s-1
kon
M-1s-1
pHTemp
°C
Serine/threonine-protein kinase receptor R3
(Homo sapiens (Human))
BDBM280370
(2-(5-chloro-2-fluorophenyl)-5-(propan-2-yl)-N-{1H-...)
Show SMILES COc1ccc(Cn2ncc3c(Nc4cc(ncc4C(C)C)-c4cc(Cl)ccc4F)ncnc23)cc1
Show InChI InChI=1S/C27H24ClFN6O/c1-16(2)21-12-30-24(20-10-18(28)6-9-23(20)29)11-25(21)34-26-22-13-33-35(27(22)32-15-31-26)14-17-4-7-19(36-3)8-5-17/h4-13,15-16H,14H2,1-3H3,(H,30,31,32,34)
US Patent
n/an/a 3.70E+3n/an/an/an/an/an/a
Medivation Technologies LLC
US Patent
Assay Description
Compound of the invention were screened in an in vitro kinase assay against several members of the TGFβ family of Ser/Thr kinases. The kinases t...
US Patent US10030004 (2018)
BindingDB Entry DOI: 10.7270/Q2QC05HQ
Bone morphogenetic protein 10
(Homo sapiens (Human))
BDBM280370
(2-(5-chloro-2-fluorophenyl)-5-(propan-2-yl)-N-{1H-...)
Show SMILES COc1ccc(Cn2ncc3c(Nc4cc(ncc4C(C)C)-c4cc(Cl)ccc4F)ncnc23)cc1
Show InChI InChI=1S/C27H24ClFN6O/c1-16(2)21-12-30-24(20-10-18(28)6-9-23(20)29)11-25(21)34-26-22-13-33-35(27(22)32-15-31-26)14-17-4-7-19(36-3)8-5-17/h4-13,15-16H,14H2,1-3H3,(H,30,31,32,34)
n/an/a>1.00E+4n/an/an/an/an/an/a
TBA
Citation and Details
Activin receptor-like kinase 3 (ALK-3)
(Homo sapiens (Human))
BDBM280370
(2-(5-chloro-2-fluorophenyl)-5-(propan-2-yl)-N-{1H-...)
Show SMILES COc1ccc(Cn2ncc3c(Nc4cc(ncc4C(C)C)-c4cc(Cl)ccc4F)ncnc23)cc1
Show InChI InChI=1S/C27H24ClFN6O/c1-16(2)21-12-30-24(20-10-18(28)6-9-23(20)29)11-25(21)34-26-22-13-33-35(27(22)32-15-31-26)14-17-4-7-19(36-3)8-5-17/h4-13,15-16H,14H2,1-3H3,(H,30,31,32,34)
US Patent
n/an/a>1.00E+4n/an/an/an/an/an/a
Medivation Technologies LLC
US Patent
Assay Description
Compound of the invention were screened in an in vitro kinase assay against several members of the TGFβ family of Ser/Thr kinases. The kinases t...
US Patent US10030004 (2018)
BindingDB Entry DOI: 10.7270/Q2QC05HQ
Activin receptor type-1B
(Homo sapiens (Human))
BDBM280370
(2-(5-chloro-2-fluorophenyl)-5-(propan-2-yl)-N-{1H-...)
Show SMILES COc1ccc(Cn2ncc3c(Nc4cc(ncc4C(C)C)-c4cc(Cl)ccc4F)ncnc23)cc1
Show InChI InChI=1S/C27H24ClFN6O/c1-16(2)21-12-30-24(20-10-18(28)6-9-23(20)29)11-25(21)34-26-22-13-33-35(27(22)32-15-31-26)14-17-4-7-19(36-3)8-5-17/h4-13,15-16H,14H2,1-3H3,(H,30,31,32,34)
Reactome pathway
US Patent
n/an/a 3.70n/an/an/an/an/an/a
Medivation Technologies LLC
US Patent
Assay Description
Compound of the invention were screened in an in vitro kinase assay against several members of the TGFβ family of Ser/Thr kinases. The kinases t...
US Patent US10030004 (2018)
BindingDB Entry DOI: 10.7270/Q2QC05HQ
TGF-beta receptor type-1
(Homo sapiens (Human))
BDBM280370
(2-(5-chloro-2-fluorophenyl)-5-(propan-2-yl)-N-{1H-...)
Show SMILES COc1ccc(Cn2ncc3c(Nc4cc(ncc4C(C)C)-c4cc(Cl)ccc4F)ncnc23)cc1
Show InChI InChI=1S/C27H24ClFN6O/c1-16(2)21-12-30-24(20-10-18(28)6-9-23(20)29)11-25(21)34-26-22-13-33-35(27(22)32-15-31-26)14-17-4-7-19(36-3)8-5-17/h4-13,15-16H,14H2,1-3H3,(H,30,31,32,34)
US Patent
n/an/a 17.7n/an/an/an/an/an/a
Medivation Technologies LLC
US Patent
Assay Description
Compound of the invention were screened in an in vitro kinase assay against several members of the TGFβ family of Ser/Thr kinases. The kinases t...
US Patent US10030004 (2018)
BindingDB Entry DOI: 10.7270/Q2QC05HQ
Bone morphogenetic protein receptor type-1B
(Mus musculus (Mouse))
BDBM280370
(2-(5-chloro-2-fluorophenyl)-5-(propan-2-yl)-N-{1H-...)
Show SMILES COc1ccc(Cn2ncc3c(Nc4cc(ncc4C(C)C)-c4cc(Cl)ccc4F)ncnc23)cc1
Show InChI InChI=1S/C27H24ClFN6O/c1-16(2)21-12-30-24(20-10-18(28)6-9-23(20)29)11-25(21)34-26-22-13-33-35(27(22)32-15-31-26)14-17-4-7-19(36-3)8-5-17/h4-13,15-16H,14H2,1-3H3,(H,30,31,32,34)
US Patent
n/an/a>1.00E+4n/an/an/an/an/an/a
Medivation Technologies LLC
US Patent
Assay Description
Compound of the invention were screened in an in vitro kinase assay against several members of the TGFβ family of Ser/Thr kinases. The kinases t...
US Patent US10030004 (2018)
BindingDB Entry DOI: 10.7270/Q2QC05HQ
Serine/threonine-protein kinase receptor R3
(Homo sapiens (Human))
BDBM280370
(2-(5-chloro-2-fluorophenyl)-5-(propan-2-yl)-N-{1H-...)
Show SMILES COc1ccc(Cn2ncc3c(Nc4cc(ncc4C(C)C)-c4cc(Cl)ccc4F)ncnc23)cc1
Show InChI InChI=1S/C27H24ClFN6O/c1-16(2)21-12-30-24(20-10-18(28)6-9-23(20)29)11-25(21)34-26-22-13-33-35(27(22)32-15-31-26)14-17-4-7-19(36-3)8-5-17/h4-13,15-16H,14H2,1-3H3,(H,30,31,32,34)
US Patent
n/an/a 3.70E+3n/an/an/an/an/an/a
Medivation Technologies LLC
US Patent
Assay Description
Compound of the invention were screened in an in vitro kinase assay against several members of the TGFβ family of Ser/Thr kinases. The kinases t...
US Patent US10501436 (2019)
BindingDB Entry DOI: 10.7270/Q20867PH
Activin receptor type-1
(Homo sapiens (Human))
BDBM280370
(2-(5-chloro-2-fluorophenyl)-5-(propan-2-yl)-N-{1H-...)
Show SMILES COc1ccc(Cn2ncc3c(Nc4cc(ncc4C(C)C)-c4cc(Cl)ccc4F)ncnc23)cc1
Show InChI InChI=1S/C27H24ClFN6O/c1-16(2)21-12-30-24(20-10-18(28)6-9-23(20)29)11-25(21)34-26-22-13-33-35(27(22)32-15-31-26)14-17-4-7-19(36-3)8-5-17/h4-13,15-16H,14H2,1-3H3,(H,30,31,32,34)
US Patent
n/an/a 8.93E+3n/an/an/an/an/an/a
Medivation Technologies LLC
US Patent
Assay Description
Compound of the invention were screened in an in vitro kinase assay against several members of the TGFβ family of Ser/Thr kinases. The kinases t...
US Patent US10501436 (2019)
BindingDB Entry DOI: 10.7270/Q20867PH
Activin receptor-like kinase 3 (ALK-3)
(Homo sapiens (Human))
BDBM280370
(2-(5-chloro-2-fluorophenyl)-5-(propan-2-yl)-N-{1H-...)
Show SMILES COc1ccc(Cn2ncc3c(Nc4cc(ncc4C(C)C)-c4cc(Cl)ccc4F)ncnc23)cc1
Show InChI InChI=1S/C27H24ClFN6O/c1-16(2)21-12-30-24(20-10-18(28)6-9-23(20)29)11-25(21)34-26-22-13-33-35(27(22)32-15-31-26)14-17-4-7-19(36-3)8-5-17/h4-13,15-16H,14H2,1-3H3,(H,30,31,32,34)
US Patent
n/an/a>1.00E+4n/an/an/an/an/an/a
Medivation Technologies LLC
US Patent
Assay Description
Compound of the invention were screened in an in vitro kinase assay against several members of the TGFβ family of Ser/Thr kinases. The kinases t...
US Patent US10501436 (2019)
BindingDB Entry DOI: 10.7270/Q20867PH
Activin receptor type-1B
(Homo sapiens (Human))
BDBM280370
(2-(5-chloro-2-fluorophenyl)-5-(propan-2-yl)-N-{1H-...)
Show SMILES COc1ccc(Cn2ncc3c(Nc4cc(ncc4C(C)C)-c4cc(Cl)ccc4F)ncnc23)cc1
Show InChI InChI=1S/C27H24ClFN6O/c1-16(2)21-12-30-24(20-10-18(28)6-9-23(20)29)11-25(21)34-26-22-13-33-35(27(22)32-15-31-26)14-17-4-7-19(36-3)8-5-17/h4-13,15-16H,14H2,1-3H3,(H,30,31,32,34)
Reactome pathway
US Patent
n/an/a 3.70n/an/an/an/an/an/a
Medivation Technologies LLC
US Patent
Assay Description
Compound of the invention were screened in an in vitro kinase assay against several members of the TGFβ family of Ser/Thr kinases. The kinases t...
US Patent US10501436 (2019)
BindingDB Entry DOI: 10.7270/Q20867PH
TGF-beta receptor type-1
(Homo sapiens (Human))
BDBM280370
(2-(5-chloro-2-fluorophenyl)-5-(propan-2-yl)-N-{1H-...)
Show SMILES COc1ccc(Cn2ncc3c(Nc4cc(ncc4C(C)C)-c4cc(Cl)ccc4F)ncnc23)cc1
Show InChI InChI=1S/C27H24ClFN6O/c1-16(2)21-12-30-24(20-10-18(28)6-9-23(20)29)11-25(21)34-26-22-13-33-35(27(22)32-15-31-26)14-17-4-7-19(36-3)8-5-17/h4-13,15-16H,14H2,1-3H3,(H,30,31,32,34)
US Patent
n/an/a 17.7n/an/an/an/an/an/a
Medivation Technologies LLC
US Patent
Assay Description
Compound of the invention were screened in an in vitro kinase assay against several members of the TGFβ family of Ser/Thr kinases. The kinases t...
US Patent US10501436 (2019)
BindingDB Entry DOI: 10.7270/Q20867PH
Bone morphogenetic protein receptor type-1B
(Homo sapiens (Human))
BDBM280370
(2-(5-chloro-2-fluorophenyl)-5-(propan-2-yl)-N-{1H-...)
Show SMILES COc1ccc(Cn2ncc3c(Nc4cc(ncc4C(C)C)-c4cc(Cl)ccc4F)ncnc23)cc1
Show InChI InChI=1S/C27H24ClFN6O/c1-16(2)21-12-30-24(20-10-18(28)6-9-23(20)29)11-25(21)34-26-22-13-33-35(27(22)32-15-31-26)14-17-4-7-19(36-3)8-5-17/h4-13,15-16H,14H2,1-3H3,(H,30,31,32,34)
US Patent
n/an/a>1.00E+4n/an/an/an/an/an/a
Medivation Technologies LLC
US Patent
Assay Description
Compound of the invention were screened in an in vitro kinase assay against several members of the TGFβ family of Ser/Thr kinases. The kinases t...
US Patent US10501436 (2019)
BindingDB Entry DOI: 10.7270/Q20867PH
Serine/threonine-protein kinase receptor R3
(Homo sapiens (Human))
BDBM280370
(2-(5-chloro-2-fluorophenyl)-5-(propan-2-yl)-N-{1H-...)
Show SMILES COc1ccc(Cn2ncc3c(Nc4cc(ncc4C(C)C)-c4cc(Cl)ccc4F)ncnc23)cc1
Show InChI InChI=1S/C27H24ClFN6O/c1-16(2)21-12-30-24(20-10-18(28)6-9-23(20)29)11-25(21)34-26-22-13-33-35(27(22)32-15-31-26)14-17-4-7-19(36-3)8-5-17/h4-13,15-16H,14H2,1-3H3,(H,30,31,32,34)
n/an/a 3.70E+3n/an/an/an/an/an/a
TBA
Citation and Details
Activin receptor type-1
(Homo sapiens (Human))
BDBM280370
(2-(5-chloro-2-fluorophenyl)-5-(propan-2-yl)-N-{1H-...)
Show SMILES COc1ccc(Cn2ncc3c(Nc4cc(ncc4C(C)C)-c4cc(Cl)ccc4F)ncnc23)cc1
Show InChI InChI=1S/C27H24ClFN6O/c1-16(2)21-12-30-24(20-10-18(28)6-9-23(20)29)11-25(21)34-26-22-13-33-35(27(22)32-15-31-26)14-17-4-7-19(36-3)8-5-17/h4-13,15-16H,14H2,1-3H3,(H,30,31,32,34)
n/an/a 8.93E+3n/an/an/an/an/an/a
TBA
Citation and Details
Activin receptor-like kinase 3 (ALK-3)
(Homo sapiens (Human))
BDBM280370
(2-(5-chloro-2-fluorophenyl)-5-(propan-2-yl)-N-{1H-...)
Show SMILES COc1ccc(Cn2ncc3c(Nc4cc(ncc4C(C)C)-c4cc(Cl)ccc4F)ncnc23)cc1
Show InChI InChI=1S/C27H24ClFN6O/c1-16(2)21-12-30-24(20-10-18(28)6-9-23(20)29)11-25(21)34-26-22-13-33-35(27(22)32-15-31-26)14-17-4-7-19(36-3)8-5-17/h4-13,15-16H,14H2,1-3H3,(H,30,31,32,34)
n/an/a>1.00E+4n/an/an/an/an/an/a
TBA
Citation and Details
Activin receptor type-1B
(Homo sapiens (Human))
BDBM280370
(2-(5-chloro-2-fluorophenyl)-5-(propan-2-yl)-N-{1H-...)
Show SMILES COc1ccc(Cn2ncc3c(Nc4cc(ncc4C(C)C)-c4cc(Cl)ccc4F)ncnc23)cc1
Show InChI InChI=1S/C27H24ClFN6O/c1-16(2)21-12-30-24(20-10-18(28)6-9-23(20)29)11-25(21)34-26-22-13-33-35(27(22)32-15-31-26)14-17-4-7-19(36-3)8-5-17/h4-13,15-16H,14H2,1-3H3,(H,30,31,32,34)
Reactome pathway
n/an/a 3.70n/an/an/an/an/an/a
TBA
Citation and Details
TGF-beta receptor type-1
(Homo sapiens (Human))
BDBM280370
(2-(5-chloro-2-fluorophenyl)-5-(propan-2-yl)-N-{1H-...)
Show SMILES COc1ccc(Cn2ncc3c(Nc4cc(ncc4C(C)C)-c4cc(Cl)ccc4F)ncnc23)cc1
Show InChI InChI=1S/C27H24ClFN6O/c1-16(2)21-12-30-24(20-10-18(28)6-9-23(20)29)11-25(21)34-26-22-13-33-35(27(22)32-15-31-26)14-17-4-7-19(36-3)8-5-17/h4-13,15-16H,14H2,1-3H3,(H,30,31,32,34)
n/an/a 17.7n/an/an/an/an/an/a
TBA
Citation and Details
Activin receptor type-1
(Homo sapiens (Human))
BDBM280370
(2-(5-chloro-2-fluorophenyl)-5-(propan-2-yl)-N-{1H-...)
Show SMILES COc1ccc(Cn2ncc3c(Nc4cc(ncc4C(C)C)-c4cc(Cl)ccc4F)ncnc23)cc1
Show InChI InChI=1S/C27H24ClFN6O/c1-16(2)21-12-30-24(20-10-18(28)6-9-23(20)29)11-25(21)34-26-22-13-33-35(27(22)32-15-31-26)14-17-4-7-19(36-3)8-5-17/h4-13,15-16H,14H2,1-3H3,(H,30,31,32,34)
US Patent
n/an/a 8.93E+3n/an/an/an/an/an/a
Medivation Technologies LLC
US Patent
Assay Description
Compound of the invention were screened in an in vitro kinase assay against several members of the TGFβ family of Ser/Thr kinases. The kinases t...
US Patent US10030004 (2018)
BindingDB Entry DOI: 10.7270/Q2QC05HQ