BDBM28045 4-(4-iodophenoxy)thieno[2,3-c]pyridine-2-carboxylic acid::CHEMBL523921::thieno[2,3-c]pyridine, 1
SMILES: OC(=O)c1cc2c(Oc3ccc(I)cc3)cncc2s1
InChI Key: InChIKey=NANXSYXGMOHIFS-UHFFFAOYSA-N
Data: 2 IC50
Activity Spreadsheet -- Enzyme Inhibition Constant Data from BindingDB
Found 2 hits for monomerid = 28045
Trg + Lig
Ki
nM
ΔG°
kcal/mole
IC50
nM
Kd
nM
EC50/IC50
nM
koff
s-1
kon
M-1s-1
pHTemp
°C
Mitogen-activated protein kinase kinase kinase 8
(Homo sapiens (Human))
BDBM28045
(4-(4-iodophenoxy)thieno[2,3-c]pyridine-2-carboxyli...)
Show SMILES OC(=O)c1cc2c(Oc3ccc(I)cc3)cncc2s1
Show InChI InChI=1S/C14H8INO3S/c15-8-1-3-9(4-2-8)19-11-6-16-7-13-10(11)5-12(20-13)14(17)18/h1-7H,(H,17,18)
NCI pathway
Reactome pathway
n/an/a 940n/an/an/an/an/an/a
Abbott Bioresearch Center
Curated by ChEMBL
Assay Description
Inhibition of human recombinant COT by HTRF-based assay
Bioorg Med Chem Lett 18: 4952-5 (2008)
Article DOI: 10.1016/j.bmcl.2008.08.037
BindingDB Entry DOI: 10.7270/Q23J3CTH
Mitogen-activated protein kinase kinase kinase 8
(Homo sapiens (Human))
BDBM28045
(4-(4-iodophenoxy)thieno[2,3-c]pyridine-2-carboxyli...)
Show SMILES OC(=O)c1cc2c(Oc3ccc(I)cc3)cncc2s1
Show InChI InChI=1S/C14H8INO3S/c15-8-1-3-9(4-2-8)19-11-6-16-7-13-10(11)5-12(20-13)14(17)18/h1-7H,(H,17,18)
NCI pathway
Reactome pathway
n/an/a 1.00E+3n/an/an/an/a7.522
Abbott Laboratories
Assay Description
The COT direct HTRF assay was carried out using biotin-MEK1 as a substrate. The reaction was carried out in black 96 half-well plates. At designated...
Bioorg Med Chem Lett 19: 1722-5 (2009)
Article DOI: 10.1016/j.bmcl.2009.01.088
BindingDB Entry DOI: 10.7270/Q2VH5M4P