null
SMILES: CC1(C)CC2(CN1Cc1ccc(cc1N1CC3COCC3C1)C(F)(F)F)CCN(CC2)C(=O)OC(C(F)(F)F)C(F)(F)F
InChI Key: InChIKey=GZZMSOUCOCWRDU-UHFFFAOYSA-N
Activity Spreadsheet -- Enzyme Inhibition Constant Data from BindingDB
Found 6 hits for monomerid = 280510
Trg + Lig
Ki
nM
ΔG°
kcal/mole
IC50
nM
Kd
nM
EC50/IC50
nM
koff
s-1
kon
M-1s-1
pHTemp
°C
Monoglyceride lipase
(Mus musculus (mouse))
BDBM280510
(US10030020, Example 55 | US10781211, Example 55)
Show SMILES CC1(C)CC2(CN1Cc1ccc(cc1N1CC3COCC3C1)C(F)(F)F)CCN(CC2)C(=O)OC(C(F)(F)F)C(F)(F)F
Show InChI InChI=1S/C28H34F9N3O3/c1-24(2)15-25(5-7-38(8-6-25)23(41)43-22(27(32,33)34)28(35,36)37)16-40(24)12-17-3-4-20(26(29,30)31)9-21(17)39-10-18-13-42-14-19(18)11-39/h3-4,9,18-19,22H,5-8,10-16H2,1-2H3
Reactome pathway
US Patent
n/an/a<100n/an/an/an/an/an/a
ABIDE THERAPEUTICS, INC.
US Patent
Assay Description
Proteomes (mouse brain membrane fraction or cell lysates) (50 μL, 1.0 mg/mL total protein concentration) were preincubated with varying concentr...
US Patent US10030020 (2018)
BindingDB Entry DOI: 10.7270/Q2FX7CGF
Fatty-acid amide hydrolase 1
(Mus musculus (mouse))
BDBM280510
(US10030020, Example 55 | US10781211, Example 55)
Show SMILES CC1(C)CC2(CN1Cc1ccc(cc1N1CC3COCC3C1)C(F)(F)F)CCN(CC2)C(=O)OC(C(F)(F)F)C(F)(F)F
Show InChI InChI=1S/C28H34F9N3O3/c1-24(2)15-25(5-7-38(8-6-25)23(41)43-22(27(32,33)34)28(35,36)37)16-40(24)12-17-3-4-20(26(29,30)31)9-21(17)39-10-18-13-42-14-19(18)11-39/h3-4,9,18-19,22H,5-8,10-16H2,1-2H3
US Patent
n/an/a>1.00E+3n/an/an/an/an/an/a
ABIDE THERAPEUTICS, INC.
US Patent
Assay Description
Proteomes (mouse brain membrane fraction or cell lysates) (50 μL, 1.0 mg/mL total protein concentration) were preincubated with varying concentr...
US Patent US10030020 (2018)
BindingDB Entry DOI: 10.7270/Q2FX7CGF
Monoacylglycerol lipase ABHD6
(Mus musculus (mouse))
BDBM280510
(US10030020, Example 55 | US10781211, Example 55)
Show SMILES CC1(C)CC2(CN1Cc1ccc(cc1N1CC3COCC3C1)C(F)(F)F)CCN(CC2)C(=O)OC(C(F)(F)F)C(F)(F)F
Show InChI InChI=1S/C28H34F9N3O3/c1-24(2)15-25(5-7-38(8-6-25)23(41)43-22(27(32,33)34)28(35,36)37)16-40(24)12-17-3-4-20(26(29,30)31)9-21(17)39-10-18-13-42-14-19(18)11-39/h3-4,9,18-19,22H,5-8,10-16H2,1-2H3
US Patent
n/an/a>1.00E+3n/an/an/an/an/an/a
LUNDBECK LA JOLLA RESEARCH CENTER, INC.
US Patent
Assay Description
MAGL, ABHD6 and FAAH: Proteomes (mouse brain membrane fraction or cell lysates) (50 μL, 1.0 mg/mL total protein concentration) were preincubated...
US Patent US10781211 (2020)
Monoglyceride lipase
(Mus musculus (mouse))
BDBM280510
(US10030020, Example 55 | US10781211, Example 55)
Show SMILES CC1(C)CC2(CN1Cc1ccc(cc1N1CC3COCC3C1)C(F)(F)F)CCN(CC2)C(=O)OC(C(F)(F)F)C(F)(F)F
Show InChI InChI=1S/C28H34F9N3O3/c1-24(2)15-25(5-7-38(8-6-25)23(41)43-22(27(32,33)34)28(35,36)37)16-40(24)12-17-3-4-20(26(29,30)31)9-21(17)39-10-18-13-42-14-19(18)11-39/h3-4,9,18-19,22H,5-8,10-16H2,1-2H3
Reactome pathway
US Patent
n/an/a<100n/an/an/an/an/an/a
LUNDBECK LA JOLLA RESEARCH CENTER, INC.
US Patent
Assay Description
MAGL, ABHD6 and FAAH: Proteomes (mouse brain membrane fraction or cell lysates) (50 μL, 1.0 mg/mL total protein concentration) were preincubated...
US Patent US10781211 (2020)
Fatty-acid amide hydrolase 1
(Mus musculus (mouse))
BDBM280510
(US10030020, Example 55 | US10781211, Example 55)
Show SMILES CC1(C)CC2(CN1Cc1ccc(cc1N1CC3COCC3C1)C(F)(F)F)CCN(CC2)C(=O)OC(C(F)(F)F)C(F)(F)F
Show InChI InChI=1S/C28H34F9N3O3/c1-24(2)15-25(5-7-38(8-6-25)23(41)43-22(27(32,33)34)28(35,36)37)16-40(24)12-17-3-4-20(26(29,30)31)9-21(17)39-10-18-13-42-14-19(18)11-39/h3-4,9,18-19,22H,5-8,10-16H2,1-2H3
US Patent
n/an/a>1.00E+3n/an/an/an/an/an/a
LUNDBECK LA JOLLA RESEARCH CENTER, INC.
US Patent
Assay Description
MAGL, ABHD6 and FAAH: Proteomes (mouse brain membrane fraction or cell lysates) (50 μL, 1.0 mg/mL total protein concentration) were preincubated...
US Patent US10781211 (2020)
Monoacylglycerol lipase ABHD2
(Mus musculus (Mouse))
BDBM280510
(US10030020, Example 55 | US10781211, Example 55)
Show SMILES CC1(C)CC2(CN1Cc1ccc(cc1N1CC3COCC3C1)C(F)(F)F)CCN(CC2)C(=O)OC(C(F)(F)F)C(F)(F)F
Show InChI InChI=1S/C28H34F9N3O3/c1-24(2)15-25(5-7-38(8-6-25)23(41)43-22(27(32,33)34)28(35,36)37)16-40(24)12-17-3-4-20(26(29,30)31)9-21(17)39-10-18-13-42-14-19(18)11-39/h3-4,9,18-19,22H,5-8,10-16H2,1-2H3
US Patent
n/an/a>1.00E+3n/an/an/an/an/an/a
ABIDE THERAPEUTICS, INC.
US Patent
Assay Description
Proteomes (mouse brain membrane fraction or cell lysates) (50 μL, 1.0 mg/mL total protein concentration) were preincubated with varying concentr...
US Patent US10030020 (2018)
BindingDB Entry DOI: 10.7270/Q2FX7CGF