null
SMILES: FC(F)(F)C(OC(=O)N1CCC2(CCCN2Cc2cccc(N3CCCCC3)c2Cl)CC1)C(F)(F)F
InChI Key: InChIKey=SFUAANGIGXHFOZ-UHFFFAOYSA-N
Activity Spreadsheet -- Enzyme Inhibition Constant Data from BindingDB
Found 6 hits for monomerid = 280535
Trg + Lig
Ki
nM
ΔG°
kcal/mole
IC50
nM
Kd
nM
EC50/IC50
nM
koff
s-1
kon
M-1s-1
pHTemp
°C
Monoglyceride lipase
(Mus musculus (mouse))
BDBM280535
(US10030020, Example 80 | US10781211, Example 80)
Show SMILES FC(F)(F)C(OC(=O)N1CCC2(CCCN2Cc2cccc(N3CCCCC3)c2Cl)CC1)C(F)(F)F
Show InChI InChI=1S/C24H30ClF6N3O2/c25-19-17(6-4-7-18(19)32-11-2-1-3-12-32)16-34-13-5-8-22(34)9-14-33(15-10-22)21(35)36-20(23(26,27)28)24(29,30)31/h4,6-7,20H,1-3,5,8-16H2
Reactome pathway
US Patent
n/an/a<100n/an/an/an/an/an/a
ABIDE THERAPEUTICS, INC.
US Patent
Assay Description
Proteomes (mouse brain membrane fraction or cell lysates) (50 μL, 1.0 mg/mL total protein concentration) were preincubated with varying concentr...
US Patent US10030020 (2018)
BindingDB Entry DOI: 10.7270/Q2FX7CGF
Fatty-acid amide hydrolase 1
(Mus musculus (mouse))
BDBM280535
(US10030020, Example 80 | US10781211, Example 80)
Show SMILES FC(F)(F)C(OC(=O)N1CCC2(CCCN2Cc2cccc(N3CCCCC3)c2Cl)CC1)C(F)(F)F
Show InChI InChI=1S/C24H30ClF6N3O2/c25-19-17(6-4-7-18(19)32-11-2-1-3-12-32)16-34-13-5-8-22(34)9-14-33(15-10-22)21(35)36-20(23(26,27)28)24(29,30)31/h4,6-7,20H,1-3,5,8-16H2
US Patent
n/an/a>1.00E+3n/an/an/an/an/an/a
ABIDE THERAPEUTICS, INC.
US Patent
Assay Description
Proteomes (mouse brain membrane fraction or cell lysates) (50 μL, 1.0 mg/mL total protein concentration) were preincubated with varying concentr...
US Patent US10030020 (2018)
BindingDB Entry DOI: 10.7270/Q2FX7CGF
Monoacylglycerol lipase ABHD6
(Mus musculus (mouse))
BDBM280535
(US10030020, Example 80 | US10781211, Example 80)
Show SMILES FC(F)(F)C(OC(=O)N1CCC2(CCCN2Cc2cccc(N3CCCCC3)c2Cl)CC1)C(F)(F)F
Show InChI InChI=1S/C24H30ClF6N3O2/c25-19-17(6-4-7-18(19)32-11-2-1-3-12-32)16-34-13-5-8-22(34)9-14-33(15-10-22)21(35)36-20(23(26,27)28)24(29,30)31/h4,6-7,20H,1-3,5,8-16H2
US Patent
n/an/a>1.00E+3n/an/an/an/an/an/a
LUNDBECK LA JOLLA RESEARCH CENTER, INC.
US Patent
Assay Description
MAGL, ABHD6 and FAAH: Proteomes (mouse brain membrane fraction or cell lysates) (50 μL, 1.0 mg/mL total protein concentration) were preincubated...
US Patent US10781211 (2020)
Monoglyceride lipase
(Mus musculus (mouse))
BDBM280535
(US10030020, Example 80 | US10781211, Example 80)
Show SMILES FC(F)(F)C(OC(=O)N1CCC2(CCCN2Cc2cccc(N3CCCCC3)c2Cl)CC1)C(F)(F)F
Show InChI InChI=1S/C24H30ClF6N3O2/c25-19-17(6-4-7-18(19)32-11-2-1-3-12-32)16-34-13-5-8-22(34)9-14-33(15-10-22)21(35)36-20(23(26,27)28)24(29,30)31/h4,6-7,20H,1-3,5,8-16H2
Reactome pathway
US Patent
n/an/a<100n/an/an/an/an/an/a
LUNDBECK LA JOLLA RESEARCH CENTER, INC.
US Patent
Assay Description
MAGL, ABHD6 and FAAH: Proteomes (mouse brain membrane fraction or cell lysates) (50 μL, 1.0 mg/mL total protein concentration) were preincubated...
US Patent US10781211 (2020)
Fatty-acid amide hydrolase 1
(Mus musculus (mouse))
BDBM280535
(US10030020, Example 80 | US10781211, Example 80)
Show SMILES FC(F)(F)C(OC(=O)N1CCC2(CCCN2Cc2cccc(N3CCCCC3)c2Cl)CC1)C(F)(F)F
Show InChI InChI=1S/C24H30ClF6N3O2/c25-19-17(6-4-7-18(19)32-11-2-1-3-12-32)16-34-13-5-8-22(34)9-14-33(15-10-22)21(35)36-20(23(26,27)28)24(29,30)31/h4,6-7,20H,1-3,5,8-16H2
US Patent
n/an/a>1.00E+3n/an/an/an/an/an/a
LUNDBECK LA JOLLA RESEARCH CENTER, INC.
US Patent
Assay Description
MAGL, ABHD6 and FAAH: Proteomes (mouse brain membrane fraction or cell lysates) (50 μL, 1.0 mg/mL total protein concentration) were preincubated...
US Patent US10781211 (2020)
Monoacylglycerol lipase ABHD2
(Mus musculus (Mouse))
BDBM280535
(US10030020, Example 80 | US10781211, Example 80)
Show SMILES FC(F)(F)C(OC(=O)N1CCC2(CCCN2Cc2cccc(N3CCCCC3)c2Cl)CC1)C(F)(F)F
Show InChI InChI=1S/C24H30ClF6N3O2/c25-19-17(6-4-7-18(19)32-11-2-1-3-12-32)16-34-13-5-8-22(34)9-14-33(15-10-22)21(35)36-20(23(26,27)28)24(29,30)31/h4,6-7,20H,1-3,5,8-16H2
US Patent
n/an/a>1.00E+3n/an/an/an/an/an/a
ABIDE THERAPEUTICS, INC.
US Patent
Assay Description
Proteomes (mouse brain membrane fraction or cell lysates) (50 μL, 1.0 mg/mL total protein concentration) were preincubated with varying concentr...
US Patent US10030020 (2018)
BindingDB Entry DOI: 10.7270/Q2FX7CGF