null
SMILES: FC(F)(F)C(OC(=O)N1CCC2(CCCN2Cc2ccc(Cl)cc2N2CCC2)CC1)C(F)(F)F
InChI Key: InChIKey=ATJGNPLMKAWGJN-UHFFFAOYSA-N
Activity Spreadsheet -- Enzyme Inhibition Constant Data from BindingDB
Found 6 hits for monomerid = 280562
Trg + Lig
Ki
nM
ΔG°
kcal/mole
IC50
nM
Kd
nM
EC50/IC50
nM
koff
s-1
kon
M-1s-1
pHTemp
°C
Monoglyceride lipase
(Mus musculus (mouse))
BDBM280562
(US10030020, Example 107 | US10781211, Example 107)
Show SMILES FC(F)(F)C(OC(=O)N1CCC2(CCCN2Cc2ccc(Cl)cc2N2CCC2)CC1)C(F)(F)F
Show InChI InChI=1S/C22H26ClF6N3O2/c23-16-4-3-15(17(13-16)30-8-2-9-30)14-32-10-1-5-20(32)6-11-31(12-7-20)19(33)34-18(21(24,25)26)22(27,28)29/h3-4,13,18H,1-2,5-12,14H2
Reactome pathway
US Patent
n/an/a<100n/an/an/an/an/an/a
ABIDE THERAPEUTICS, INC.
US Patent
Assay Description
Proteomes (mouse brain membrane fraction or cell lysates) (50 μL, 1.0 mg/mL total protein concentration) were preincubated with varying concentr...
US Patent US10030020 (2018)
BindingDB Entry DOI: 10.7270/Q2FX7CGF
Fatty-acid amide hydrolase 1
(Mus musculus (mouse))
BDBM280562
(US10030020, Example 107 | US10781211, Example 107)
Show SMILES FC(F)(F)C(OC(=O)N1CCC2(CCCN2Cc2ccc(Cl)cc2N2CCC2)CC1)C(F)(F)F
Show InChI InChI=1S/C22H26ClF6N3O2/c23-16-4-3-15(17(13-16)30-8-2-9-30)14-32-10-1-5-20(32)6-11-31(12-7-20)19(33)34-18(21(24,25)26)22(27,28)29/h3-4,13,18H,1-2,5-12,14H2
US Patent
n/an/a>1.00E+3n/an/an/an/an/an/a
ABIDE THERAPEUTICS, INC.
US Patent
Assay Description
Proteomes (mouse brain membrane fraction or cell lysates) (50 μL, 1.0 mg/mL total protein concentration) were preincubated with varying concentr...
US Patent US10030020 (2018)
BindingDB Entry DOI: 10.7270/Q2FX7CGF
Monoacylglycerol lipase ABHD6
(Mus musculus (mouse))
BDBM280562
(US10030020, Example 107 | US10781211, Example 107)
Show SMILES FC(F)(F)C(OC(=O)N1CCC2(CCCN2Cc2ccc(Cl)cc2N2CCC2)CC1)C(F)(F)F
Show InChI InChI=1S/C22H26ClF6N3O2/c23-16-4-3-15(17(13-16)30-8-2-9-30)14-32-10-1-5-20(32)6-11-31(12-7-20)19(33)34-18(21(24,25)26)22(27,28)29/h3-4,13,18H,1-2,5-12,14H2
US Patent
n/an/a>1.00E+3n/an/an/an/an/an/a
LUNDBECK LA JOLLA RESEARCH CENTER, INC.
US Patent
Assay Description
MAGL, ABHD6 and FAAH: Proteomes (mouse brain membrane fraction or cell lysates) (50 μL, 1.0 mg/mL total protein concentration) were preincubated...
US Patent US10781211 (2020)
Monoglyceride lipase
(Mus musculus (mouse))
BDBM280562
(US10030020, Example 107 | US10781211, Example 107)
Show SMILES FC(F)(F)C(OC(=O)N1CCC2(CCCN2Cc2ccc(Cl)cc2N2CCC2)CC1)C(F)(F)F
Show InChI InChI=1S/C22H26ClF6N3O2/c23-16-4-3-15(17(13-16)30-8-2-9-30)14-32-10-1-5-20(32)6-11-31(12-7-20)19(33)34-18(21(24,25)26)22(27,28)29/h3-4,13,18H,1-2,5-12,14H2
Reactome pathway
US Patent
n/an/a<100n/an/an/an/an/an/a
LUNDBECK LA JOLLA RESEARCH CENTER, INC.
US Patent
Assay Description
MAGL, ABHD6 and FAAH: Proteomes (mouse brain membrane fraction or cell lysates) (50 μL, 1.0 mg/mL total protein concentration) were preincubated...
US Patent US10781211 (2020)
Fatty-acid amide hydrolase 1
(Mus musculus (mouse))
BDBM280562
(US10030020, Example 107 | US10781211, Example 107)
Show SMILES FC(F)(F)C(OC(=O)N1CCC2(CCCN2Cc2ccc(Cl)cc2N2CCC2)CC1)C(F)(F)F
Show InChI InChI=1S/C22H26ClF6N3O2/c23-16-4-3-15(17(13-16)30-8-2-9-30)14-32-10-1-5-20(32)6-11-31(12-7-20)19(33)34-18(21(24,25)26)22(27,28)29/h3-4,13,18H,1-2,5-12,14H2
US Patent
n/an/a>1.00E+3n/an/an/an/an/an/a
LUNDBECK LA JOLLA RESEARCH CENTER, INC.
US Patent
Assay Description
MAGL, ABHD6 and FAAH: Proteomes (mouse brain membrane fraction or cell lysates) (50 μL, 1.0 mg/mL total protein concentration) were preincubated...
US Patent US10781211 (2020)
Monoacylglycerol lipase ABHD2
(Mus musculus (Mouse))
BDBM280562
(US10030020, Example 107 | US10781211, Example 107)
Show SMILES FC(F)(F)C(OC(=O)N1CCC2(CCCN2Cc2ccc(Cl)cc2N2CCC2)CC1)C(F)(F)F
Show InChI InChI=1S/C22H26ClF6N3O2/c23-16-4-3-15(17(13-16)30-8-2-9-30)14-32-10-1-5-20(32)6-11-31(12-7-20)19(33)34-18(21(24,25)26)22(27,28)29/h3-4,13,18H,1-2,5-12,14H2
US Patent
n/an/a>1.00E+3n/an/an/an/an/an/a
ABIDE THERAPEUTICS, INC.
US Patent
Assay Description
Proteomes (mouse brain membrane fraction or cell lysates) (50 μL, 1.0 mg/mL total protein concentration) were preincubated with varying concentr...
US Patent US10030020 (2018)
BindingDB Entry DOI: 10.7270/Q2FX7CGF