BDBM280945 3-(2-{4-amino-2- [1-(3-fluoro- benzyl)-1H- indazol-3-yl]-5- methyl-6-oxo- 6,7-dihydro-5H- pyrrolo[2,3-d] pyrimidin-5-yl}- 1,3-oxazol-4-yl)- 2,2-dimethyl- propanoic acid::US10030027, Example 223A::US10428076, Example 223A
SMILES: CC(C)(Cc1coc(n1)C1(C)C(=O)Nc2nc(nc(N)c12)-c1nn(Cc2cccc(F)c2)c2ccccc12)C(O)=O
InChI Key: InChIKey=FCRWARLXWKKOOY-UHFFFAOYSA-N
Data: 2 KI
Activity Spreadsheet -- Enzyme Inhibition Constant Data from BindingDB
Found 2 hits for monomerid = 280945
Trg + Lig
Ki
nM
ΔG°
kcal/mole
IC50
nM
Kd
nM
EC50/IC50
nM
koff
s-1
kon
M-1s-1
pHTemp
°C
Soluble Guanylate Cyclases
(Homo sapiens (Human))
BDBM280945
(3-(2-{4-amino-2- [1-(3-fluoro- benzyl)-1H- indazol...)
Show SMILES CC(C)(Cc1coc(n1)C1(C)C(=O)Nc2nc(nc(N)c12)-c1nn(Cc2cccc(F)c2)c2ccccc12)C(O)=O
Show InChI InChI=1S/C29H26FN7O4/c1-28(2,27(39)40)12-17-14-41-26(32-17)29(3)20-22(31)33-24(34-23(20)35-25(29)38)21-18-9-4-5-10-19(18)37(36-21)13-15-7-6-8-16(30)11-15/h4-11,14H,12-13H2,1-3H3,(H,39,40)(H3,31,33,34,35,38)
US Patent
0.0500n/an/an/an/an/an/an/an/a
Merck Sharp & Dohme Corp.
US Patent
Assay Description
The binding buffer was composed of 50 mM triethanolamine, pH 7.4, 3 mM MgCl2, 0.025% BSA, 2 mM dithiothreitol (DTT), 300 μM DETA/NO and 400 _...
US Patent US10428076 (2019)
BindingDB Entry DOI: 10.7270/Q22N54P9
Guanylate cyclase soluble subunit alpha-1
(Homo sapiens (Human))
BDBM280945
(3-(2-{4-amino-2- [1-(3-fluoro- benzyl)-1H- indazol...)
Show SMILES CC(C)(Cc1coc(n1)C1(C)C(=O)Nc2nc(nc(N)c12)-c1nn(Cc2cccc(F)c2)c2ccccc12)C(O)=O
Show InChI InChI=1S/C29H26FN7O4/c1-28(2,27(39)40)12-17-14-41-26(32-17)29(3)20-22(31)33-24(34-23(20)35-25(29)38)21-18-9-4-5-10-19(18)37(36-21)13-15-7-6-8-16(30)11-15/h4-11,14H,12-13H2,1-3H3,(H,39,40)(H3,31,33,34,35,38)
US Patent
0.0500n/an/an/an/an/an/a7.4n/a
Merck Sharp & Dohme Corp.
US Patent
Assay Description
The binding potencies of sGC compounds to the human recombinant sGC enzyme were determined in a Size Exclusion Chromatography (SEC) competition bindi...
US Patent US10030027 (2018)
BindingDB Entry DOI: 10.7270/Q22N549C