BDBM281210 US10022354, Example 150
SMILES: CC(C)c1cc([nH]n1)C(=O)N1CCC(C1)NC(=O)c1ccccc1Cl
InChI Key: InChIKey=KKPVZVPMPYJKOI-UHFFFAOYSA-N
Data: 1 IC50
Activity Spreadsheet -- Enzyme Inhibition Constant Data from BindingDB
Found 1 hit for monomerid = 281210
Trg + Lig
Ki
nM
ΔG°
kcal/mole
IC50
nM
Kd
nM
EC50/IC50
nM
koff
s-1
kon
M-1s-1
pHTemp
°C
Lysine-specific demethylase 5A
(Homo sapiens (Human))
BDBM281210
(US10022354, Example 150)
Show SMILES CC(C)c1cc([nH]n1)C(=O)N1CCC(C1)NC(=O)c1ccccc1Cl
Show InChI InChI=1S/C18H21ClN4O2/c1-11(2)15-9-16(22-21-15)18(25)23-8-7-12(10-23)20-17(24)13-5-3-4-6-14(13)19/h3-6,9,11-12H,7-8,10H2,1-2H3,(H,20,24)(H,21,22)
Reactome pathway
US Patent
n/an/a 0.0980n/an/an/an/a7.025
GENENTECH, INC.; CONSTELLATION PHARMACEUTICALS INC.
US Patent
Assay Description
Full length KDM5A enzyme was expressed and purified inhouse. Biotin-H3K4me3 peptide was purchased from New England Biolabs. HTRF reagents (containing...
US Patent US10022354 (2018)
BindingDB Entry DOI: 10.7270/Q2PC34F7