BDBM28124 3-cyanoquinoline, 9::6-methoxy-7-[3-(morpholin-4-yl)propoxy]-4-{[4-(phenylsulfanyl)phenyl]amino}quinoline-3-carbonitrile::CHEMBL29714
SMILES: COc1cc2c(Nc3ccc(Sc4ccccc4)cc3)c(cnc2cc1OCCCN1CCOCC1)C#N
InChI Key: InChIKey=BJFKJWBIIASAMU-UHFFFAOYSA-N
Data: 3 IC50
Activity Spreadsheet -- Enzyme Inhibition Constant Data from BindingDB
Found 3 hits for monomerid = 28124
Trg + Lig
Ki
nM
ΔG°
kcal/mole
IC50
nM
Kd
nM
EC50/IC50
nM
koff
s-1
kon
M-1s-1
pHTemp
°C
Insulin-like growth factor I receptor
(Homo sapiens (Human))
BDBM28124
(3-cyanoquinoline, 9 | 6-methoxy-7-[3-(morpholin-4-...)
Show SMILES COc1cc2c(Nc3ccc(Sc4ccccc4)cc3)c(cnc2cc1OCCCN1CCOCC1)C#N
Show InChI InChI=1S/C30H30N4O3S/c1-35-28-18-26-27(19-29(28)37-15-5-12-34-13-16-36-17-14-34)32-21-22(20-31)30(26)33-23-8-10-25(11-9-23)38-24-6-3-2-4-7-24/h2-4,6-11,18-19,21H,5,12-17H2,1H3,(H,32,33)
Reactome pathway
n/an/a 1.09E+3n/an/an/an/an/an/a
Wyeth Research
Assay Description
Assays were performed in microtiter plates in reaction buffer containing biotinylated substrate, ATP, and purified kinase in the presence of test com...
Bioorg Med Chem Lett 19: 62-6 (2009)
Article DOI: 10.1016/j.bmcl.2008.11.037
BindingDB Entry DOI: 10.7270/Q2M32T38
Dual specificity mitogen-activated protein kinase kinase 1/Mitogen-activated protein kinase 1/RAF proto-oncogene serine/threonine-protein kinase
(Homo sapiens (Human))
BDBM28124
(3-cyanoquinoline, 9 | 6-methoxy-7-[3-(morpholin-4-...)
Show SMILES COc1cc2c(Nc3ccc(Sc4ccccc4)cc3)c(cnc2cc1OCCCN1CCOCC1)C#N
Show InChI InChI=1S/C30H30N4O3S/c1-35-28-18-26-27(19-29(28)37-15-5-12-34-13-16-36-17-14-34)32-21-22(20-31)30(26)33-23-8-10-25(11-9-23)38-24-6-3-2-4-7-24/h2-4,6-11,18-19,21H,5,12-17H2,1H3,(H,32,33)
Reactome pathway
n/an/a 5.70n/an/an/an/an/an/a
Wyeth-Ayerst Research
Curated by ChEMBL
Assay Description
Inhibitory activity against Dual specificity mitogen-activated protein kinase kinase using direct MEK assay (which by-passes the need for activated R...
Bioorg Med Chem Lett 11: 1407-10 (2001)
BindingDB Entry DOI: 10.7270/Q2RB73WF
Dual specificity mitogen-activated protein kinase kinase 1
(Homo sapiens (Human))
BDBM28124
(3-cyanoquinoline, 9 | 6-methoxy-7-[3-(morpholin-4-...)
Show SMILES COc1cc2c(Nc3ccc(Sc4ccccc4)cc3)c(cnc2cc1OCCCN1CCOCC1)C#N
Show InChI InChI=1S/C30H30N4O3S/c1-35-28-18-26-27(19-29(28)37-15-5-12-34-13-16-36-17-14-34)32-21-22(20-31)30(26)33-23-8-10-25(11-9-23)38-24-6-3-2-4-7-24/h2-4,6-11,18-19,21H,5,12-17H2,1H3,(H,32,33)
Reactome pathway
n/an/a 1.10n/an/an/an/an/an/a
Wyeth-Ayerst Research
Curated by ChEMBL
Assay Description
Inhibitory activity against Dual specificity mitogen-activated protein kinase kinase using coupled MEK assay (which uses activated Raf to activate an...
Bioorg Med Chem Lett 11: 1407-10 (2001)
BindingDB Entry DOI: 10.7270/Q2RB73WF