BDBM281288 US10022354, Example 228
SMILES: CC(C)c1cc([nH]n1)C(=O)N1CC[C@H](C1)NC(=O)C1CC11CC1
InChI Key:
Data: 1 IC50
Activity Spreadsheet -- Enzyme Inhibition Constant Data from BindingDB
Found 1 hit for monomerid = 281288
Trg + Lig
Ki
nM
ΔG°
kcal/mole
IC50
nM
Kd
nM
EC50/IC50
nM
koff
s-1
kon
M-1s-1
pHTemp
°C
Lysine-specific demethylase 5A
(Homo sapiens (Human))
BDBM281288
(US10022354, Example 228)
Show SMILES CC(C)c1cc([nH]n1)C(=O)N1CC[C@H](C1)NC(=O)C1CC11CC1 |r|
Reactome pathway
US Patent
n/an/a 0.0780n/an/an/an/a7.025
GENENTECH, INC.; CONSTELLATION PHARMACEUTICALS INC.
US Patent
Assay Description
Full length KDM5A enzyme was expressed and purified inhouse. Biotin-H3K4me3 peptide was purchased from New England Biolabs. HTRF reagents (containing...
US Patent US10022354 (2018)
BindingDB Entry DOI: 10.7270/Q2PC34F7