BDBM281626 US10022461, Compound 93
SMILES: CNc1cc(ccn1)-c1ccc(nc1)-n1ccc2ccncc12
InChI Key: InChIKey=HAELMOSILBMUAB-UHFFFAOYSA-N
Data: 1 KI
Activity Spreadsheet -- Enzyme Inhibition Constant Data from BindingDB
Found 1 hit for monomerid = 281626
Trg + Lig
Ki
nM
ΔG°
kcal/mole
IC50
nM
Kd
nM
EC50/IC50
nM
koff
s-1
kon
M-1s-1
pHTemp
°C
Microtubule-associated protein tau
(Homo sapiens (Human))
BDBM281626
(US10022461, Compound 93)
Show SMILES CNc1cc(ccn1)-c1ccc(nc1)-n1ccc2ccncc12
Show InChI InChI=1S/C18H15N5/c1-19-17-10-14(5-8-21-17)15-2-3-18(22-11-15)23-9-6-13-4-7-20-12-16(13)23/h2-12H,1H3,(H,19,21)
US Patent
0.530 -12.6n/an/an/an/an/a7.425
Merck Sharp & Dohme Corp.
US Patent
Assay Description
For displacement tau binding assay, unlabeled test compounds were dissolved in DMSO at 1 mM. Dilutions of tests compounds to various concentrations w...
US Patent US10022461 (2018)
BindingDB Entry DOI: 10.7270/Q2959KK6