BDBM28165 5-(1H-1,3-benzodiazol-1-yl)-3-{[2-(trifluoromethyl)phenyl]methoxy}thiophene-2-carboxamide::benzimidazole thiophene analogue, 16
SMILES: NC(=O)c1sc(cc1OCc1ccccc1C(F)(F)F)-n1cnc2ccccc12
InChI Key: InChIKey=ITAJXWHXKVYGCF-UHFFFAOYSA-N
Data: 2 IC50  1 EC50
Activity Spreadsheet -- Enzyme Inhibition Constant Data from BindingDB
Found 3 hits for monomerid = 28165
Trg + Lig
Ki
nM
ΔG°
kcal/mole
IC50
nM
Kd
nM
EC50/IC50
nM
koff
s-1
kon
M-1s-1
pHTemp
°C
Serine/threonine-protein kinase PLK1
(Homo sapiens (Human))
BDBM28165
(5-(1H-1,3-benzodiazol-1-yl)-3-{[2-(trifluoromethyl...)
Show SMILES NC(=O)c1sc(cc1OCc1ccccc1C(F)(F)F)-n1cnc2ccccc12
Show InChI InChI=1S/C20H14F3N3O2S/c21-20(22,23)13-6-2-1-5-12(13)10-28-16-9-17(29-18(16)19(24)27)26-11-25-14-7-3-4-8-15(14)26/h1-9,11H,10H2,(H2,24,27)
NCI pathway
Reactome pathway
n/an/a 15n/an/an/an/a7.222
GSK
Assay Description
The compound inhibitory activity was determined by incubation with purified PLK enzyme and biotinylated peptide substrate in the presence ATP/[gamma-...
Bioorg Med Chem Lett 19: 1018-21 (2009)
Article DOI: 10.1016/j.bmcl.2008.11.041
BindingDB Entry DOI: 10.7270/Q26T0JZX
Serine/threonine-protein kinase PLK1
(Homo sapiens (Human))
BDBM28165
(5-(1H-1,3-benzodiazol-1-yl)-3-{[2-(trifluoromethyl...)
Show SMILES NC(=O)c1sc(cc1OCc1ccccc1C(F)(F)F)-n1cnc2ccccc12
Show InChI InChI=1S/C20H14F3N3O2S/c21-20(22,23)13-6-2-1-5-12(13)10-28-16-9-17(29-18(16)19(24)27)26-11-25-14-7-3-4-8-15(14)26/h1-9,11H,10H2,(H2,24,27)
NCI pathway
Reactome pathway
n/an/a 35n/an/an/an/an/an/a
Banyu Tsukuba Research Institute
Curated by ChEMBL
Assay Description
Inhibition of PLK1
Bioorg Med Chem Lett 19: 4673-8 (2009)
Article DOI: 10.1016/j.bmcl.2009.06.084
BindingDB Entry DOI: 10.7270/Q22R3RQG
Serine/threonine-protein kinase PLK1
(Homo sapiens (Human))
BDBM28165
(5-(1H-1,3-benzodiazol-1-yl)-3-{[2-(trifluoromethyl...)
Show SMILES NC(=O)c1sc(cc1OCc1ccccc1C(F)(F)F)-n1cnc2ccccc12
Show InChI InChI=1S/C20H14F3N3O2S/c21-20(22,23)13-6-2-1-5-12(13)10-28-16-9-17(29-18(16)19(24)27)26-11-25-14-7-3-4-8-15(14)26/h1-9,11H,10H2,(H2,24,27)
NCI pathway
Reactome pathway
n/an/an/an/a 2.00E+3n/an/an/an/a
Banyu Tsukuba Research Institute
Curated by ChEMBL
Assay Description
Inhibition of PLK1-mediated mitosis in human HeLaS3 cells after 18 hrs
Bioorg Med Chem Lett 19: 4673-8 (2009)
Article DOI: 10.1016/j.bmcl.2009.06.084
BindingDB Entry DOI: 10.7270/Q22R3RQG