BDBM28176 3-(benzyloxy)-5-(5,6-dimethoxy-1H-1,3-benzodiazol-1-yl)thiophene-2-carboxamide::benzimidazole thiophene analogue, 27
SMILES: COc1cc2ncn(-c3cc(OCc4ccccc4)c(s3)C(N)=O)c2cc1OC
InChI Key: InChIKey=BVFNLUKEPFBRGA-UHFFFAOYSA-N
Data: 1 IC50
PDB links: 1 PDB ID contains inhibitors having a similarity of 90% to this monomer.
Activity Spreadsheet -- Enzyme Inhibition Constant Data from BindingDB
Found 1 hit for monomerid = 28176
Trg + Lig
Ki
nM
ΔG°
kcal/mole
IC50
nM
Kd
nM
EC50/IC50
nM
koff
s-1
kon
M-1s-1
pHTemp
°C
Serine/threonine-protein kinase PLK1
(Homo sapiens (Human))
BDBM28176
(3-(benzyloxy)-5-(5,6-dimethoxy-1H-1,3-benzodiazol-...)
Show SMILES COc1cc2ncn(-c3cc(OCc4ccccc4)c(s3)C(N)=O)c2cc1OC
Show InChI InChI=1S/C21H19N3O4S/c1-26-16-8-14-15(9-17(16)27-2)24(12-23-14)19-10-18(20(29-19)21(22)25)28-11-13-6-4-3-5-7-13/h3-10,12H,11H2,1-2H3,(H2,22,25)
NCI pathway
Reactome pathway
n/an/a 12n/an/an/an/a7.222
GSK
Assay Description
The compound inhibitory activity was determined by incubation with purified PLK enzyme and biotinylated peptide substrate in the presence ATP/[gamma-...
Bioorg Med Chem Lett 19: 1018-21 (2009)
Article DOI: 10.1016/j.bmcl.2008.11.041
BindingDB Entry DOI: 10.7270/Q26T0JZX