BDBM28191 3-(cyclohexylmethoxy)-5-(5,6-dimethoxy-1H-1,3-benzodiazol-1-yl)thiophene-2-carboxamide::benzimidazole thiophene analogue, 43
SMILES: COc1cc2ncn(-c3cc(OCC4CCCCC4)c(s3)C(N)=O)c2cc1OC
InChI Key: InChIKey=WLALQQYUBWGRLL-UHFFFAOYSA-N
Data: 1 IC50
Activity Spreadsheet -- Enzyme Inhibition Constant Data from BindingDB
Found 1 hit for monomerid = 28191
Trg + Lig
Ki
nM
ΔG°
kcal/mole
IC50
nM
Kd
nM
EC50/IC50
nM
koff
s-1
kon
M-1s-1
pHTemp
°C
Serine/threonine-protein kinase PLK1
(Homo sapiens (Human))
BDBM28191
(3-(cyclohexylmethoxy)-5-(5,6-dimethoxy-1H-1,3-benz...)
Show SMILES COc1cc2ncn(-c3cc(OCC4CCCCC4)c(s3)C(N)=O)c2cc1OC
Show InChI InChI=1S/C21H25N3O4S/c1-26-16-8-14-15(9-17(16)27-2)24(12-23-14)19-10-18(20(29-19)21(22)25)28-11-13-6-4-3-5-7-13/h8-10,12-13H,3-7,11H2,1-2H3,(H2,22,25)
NCI pathway
Reactome pathway
n/an/a 17n/an/an/an/an/an/a
GSK
Assay Description
The compound inhibitory activity was determined by incubation with purified PLK enzyme and biotinylated peptide substrate in the presence ATP/[gamma-...
Bioorg Med Chem Lett 19: 1018-21 (2009)
Article DOI: 10.1016/j.bmcl.2008.11.041
BindingDB Entry DOI: 10.7270/Q26T0JZX