BDBM28206 3-[(1R)-1-(2-chlorophenyl)ethoxy]-5-(5,6-dimethoxy-1H-1,3-benzodiazol-1-yl)thiophene-2-carboxamide::benzimidazole thiophene carboxamide, 3
SMILES: COc1cc2ncn(-c3cc(O[C@H](C)c4ccccc4Cl)c(s3)C(N)=O)c2cc1OC
InChI Key: InChIKey=UHCHLTQBLNUYRT-GFCCVEGCSA-N
Data: 2 IC50
PDB links: 1 PDB ID matches this monomer.
Activity Spreadsheet -- Enzyme Inhibition Constant Data from BindingDB
Found 2 hits for monomerid = 28206
Trg + Lig
Ki
nM
ΔG°
kcal/mole
IC50
nM
Kd
nM
EC50/IC50
nM
koff
s-1
kon
M-1s-1
pHTemp
°C
Serine/threonine-protein kinase PLK3
(Homo sapiens (Human))
BDBM28206
(3-[(1R)-1-(2-chlorophenyl)ethoxy]-5-(5,6-dimethoxy...)
Show SMILES COc1cc2ncn(-c3cc(O[C@H](C)c4ccccc4Cl)c(s3)C(N)=O)c2cc1OC |r|
Show InChI InChI=1S/C22H20ClN3O4S/c1-12(13-6-4-5-7-14(13)23)30-19-10-20(31-21(19)22(24)27)26-11-25-15-8-17(28-2)18(29-3)9-16(15)26/h4-12H,1-3H3,(H2,24,27)/t12-/m1/s1
NCI pathway
n/an/a 6n/an/an/an/a7.222
GSK
Assay Description
The compound inhibitory activity was determined by incubation with purified PLK enzyme and biotinylated peptide substrate in the presence ATP/[gamma-...
Bioorg Med Chem Lett 19: 1694-7 (2009)
Article DOI: 10.1016/j.bmcl.2009.01.094
BindingDB Entry DOI: 10.7270/Q2319T6X
Serine/threonine-protein kinase PLK1
(Homo sapiens (Human))
BDBM28206
(3-[(1R)-1-(2-chlorophenyl)ethoxy]-5-(5,6-dimethoxy...)
Show SMILES COc1cc2ncn(-c3cc(O[C@H](C)c4ccccc4Cl)c(s3)C(N)=O)c2cc1OC |r|
Show InChI InChI=1S/C22H20ClN3O4S/c1-12(13-6-4-5-7-14(13)23)30-19-10-20(31-21(19)22(24)27)26-11-25-15-8-17(28-2)18(29-3)9-16(15)26/h4-12H,1-3H3,(H2,24,27)/t12-/m1/s1
NCI pathway
Reactome pathway
n/an/a 0.800n/an/an/an/a7.222
GSK
Assay Description
The compound inhibitory activity was determined by incubation with purified PLK enzyme and biotinylated peptide substrate in the presence ATP/[gamma-...
Bioorg Med Chem Lett 19: 1694-7 (2009)
Article DOI: 10.1016/j.bmcl.2009.01.094
BindingDB Entry DOI: 10.7270/Q2319T6X