BDBM28208 3-[(1R)-1-(2-chlorophenyl)ethoxy]-5-(6-methoxy-1H-1,3-benzodiazol-1-yl)thiophene-2-carboxamide::benzimidazole thiophene carboxamide, 16
SMILES: COc1ccc2ncn(-c3cc(O[C@H](C)c4ccccc4Cl)c(s3)C(N)=O)c2c1
InChI Key: InChIKey=YWNUJKWNTHEOIR-GFCCVEGCSA-N
Data: 2 IC50
PDB links: 1 PDB ID contains this monomer as substructures. 1 PDB ID contains inhibitors having a similarity of 90% to this monomer.
Activity Spreadsheet -- Enzyme Inhibition Constant Data from BindingDB
Found 2 hits for monomerid = 28208
Trg + Lig
Ki
nM
ΔG°
kcal/mole
IC50
nM
Kd
nM
EC50/IC50
nM
koff
s-1
kon
M-1s-1
pHTemp
°C
Serine/threonine-protein kinase PLK3
(Homo sapiens (Human))
BDBM28208
(3-[(1R)-1-(2-chlorophenyl)ethoxy]-5-(6-methoxy-1H-...)
Show SMILES COc1ccc2ncn(-c3cc(O[C@H](C)c4ccccc4Cl)c(s3)C(N)=O)c2c1 |r|
Show InChI InChI=1S/C21H18ClN3O3S/c1-12(14-5-3-4-6-15(14)22)28-18-10-19(29-20(18)21(23)26)25-11-24-16-8-7-13(27-2)9-17(16)25/h3-12H,1-2H3,(H2,23,26)/t12-/m1/s1
NCI pathway
n/an/a 35n/an/an/an/a7.222
GSK
Assay Description
The compound inhibitory activity was determined by incubation with purified PLK enzyme and biotinylated peptide substrate in the presence ATP/[gamma-...
Bioorg Med Chem Lett 19: 1694-7 (2009)
Article DOI: 10.1016/j.bmcl.2009.01.094
BindingDB Entry DOI: 10.7270/Q2319T6X
Serine/threonine-protein kinase PLK1
(Homo sapiens (Human))
BDBM28208
(3-[(1R)-1-(2-chlorophenyl)ethoxy]-5-(6-methoxy-1H-...)
Show SMILES COc1ccc2ncn(-c3cc(O[C@H](C)c4ccccc4Cl)c(s3)C(N)=O)c2c1 |r|
Show InChI InChI=1S/C21H18ClN3O3S/c1-12(14-5-3-4-6-15(14)22)28-18-10-19(29-20(18)21(23)26)25-11-24-16-8-7-13(27-2)9-17(16)25/h3-12H,1-2H3,(H2,23,26)/t12-/m1/s1
NCI pathway
Reactome pathway
n/an/a 1n/an/an/an/a7.222
GSK
Assay Description
The compound inhibitory activity was determined by incubation with purified PLK enzyme and biotinylated peptide substrate in the presence ATP/[gamma-...
Bioorg Med Chem Lett 19: 1694-7 (2009)
Article DOI: 10.1016/j.bmcl.2009.01.094
BindingDB Entry DOI: 10.7270/Q2319T6X