BDBM28214 3-[(1R)-1-(2-chlorophenyl)ethoxy]-5-{6-[(1-methylpiperidin-4-yl)methoxy]-1H-1,3-benzodiazol-1-yl}thiophene-2-carboxamide::benzimidazole thiophene carboxamide, 22
SMILES: C[C@@H](Oc1cc(sc1C(N)=O)-n1cnc2ccc(OCC3CCN(C)CC3)cc12)c1ccccc1Cl
InChI Key: InChIKey=FCJBLTLQBCHRIE-QGZVFWFLSA-N
Data: 2 IC50
Activity Spreadsheet -- Enzyme Inhibition Constant Data from BindingDB
Found 2 hits for monomerid = 28214
Trg + Lig
Ki
nM
ΔG°
kcal/mole
IC50
nM
Kd
nM
EC50/IC50
nM
koff
s-1
kon
M-1s-1
pHTemp
°C
Serine/threonine-protein kinase PLK3
(Homo sapiens (Human))
BDBM28214
(3-[(1R)-1-(2-chlorophenyl)ethoxy]-5-{6-[(1-methylp...)
Show SMILES C[C@@H](Oc1cc(sc1C(N)=O)-n1cnc2ccc(OCC3CCN(C)CC3)cc12)c1ccccc1Cl |r|
Show InChI InChI=1S/C27H29ClN4O3S/c1-17(20-5-3-4-6-21(20)28)35-24-14-25(36-26(24)27(29)33)32-16-30-22-8-7-19(13-23(22)32)34-15-18-9-11-31(2)12-10-18/h3-8,13-14,16-18H,9-12,15H2,1-2H3,(H2,29,33)/t17-/m1/s1
NCI pathway
n/an/a 1.10E+3n/an/an/an/a7.222
GSK
Assay Description
The compound inhibitory activity was determined by incubation with purified PLK enzyme and biotinylated peptide substrate in the presence ATP/[gamma-...
Bioorg Med Chem Lett 19: 1694-7 (2009)
Article DOI: 10.1016/j.bmcl.2009.01.094
BindingDB Entry DOI: 10.7270/Q2319T6X
Serine/threonine-protein kinase PLK1
(Homo sapiens (Human))
BDBM28214
(3-[(1R)-1-(2-chlorophenyl)ethoxy]-5-{6-[(1-methylp...)
Show SMILES C[C@@H](Oc1cc(sc1C(N)=O)-n1cnc2ccc(OCC3CCN(C)CC3)cc12)c1ccccc1Cl |r|
Show InChI InChI=1S/C27H29ClN4O3S/c1-17(20-5-3-4-6-21(20)28)35-24-14-25(36-26(24)27(29)33)32-16-30-22-8-7-19(13-23(22)32)34-15-18-9-11-31(2)12-10-18/h3-8,13-14,16-18H,9-12,15H2,1-2H3,(H2,29,33)/t17-/m1/s1
NCI pathway
Reactome pathway
n/an/a 6n/an/an/an/a7.222
GSK
Assay Description
The compound inhibitory activity was determined by incubation with purified PLK enzyme and biotinylated peptide substrate in the presence ATP/[gamma-...
Bioorg Med Chem Lett 19: 1694-7 (2009)
Article DOI: 10.1016/j.bmcl.2009.01.094
BindingDB Entry DOI: 10.7270/Q2319T6X