null
SMILES: C[C@@H](Oc1cc(sc1C(N)=O)-n1cnc2ccc(OC3CCNCC3)cc12)c1ccccc1C(F)(F)F
InChI Key: InChIKey=SLGRRBVHGIPHNQ-OAHLLOKOSA-N
Activity Spreadsheet -- Enzyme Inhibition Constant Data from BindingDB
Found 2 hits for monomerid = 28215
Trg + Lig
Ki
nM
ΔG°
kcal/mole
IC50
nM
Kd
nM
EC50/IC50
nM
koff
s-1
kon
M-1s-1
pHTemp
°C
Serine/threonine-protein kinase PLK3
(Homo sapiens (Human))
BDBM28215
(5-[6-(piperidin-4-yloxy)-1H-1,3-benzodiazol-1-yl]-...)
Show SMILES C[C@@H](Oc1cc(sc1C(N)=O)-n1cnc2ccc(OC3CCNCC3)cc12)c1ccccc1C(F)(F)F |r|
Show InChI InChI=1S/C26H25F3N4O3S/c1-15(18-4-2-3-5-19(18)26(27,28)29)35-22-13-23(37-24(22)25(30)34)33-14-32-20-7-6-17(12-21(20)33)36-16-8-10-31-11-9-16/h2-7,12-16,31H,8-11H2,1H3,(H2,30,34)/t15-/m1/s1
NCI pathway
n/an/a 350n/an/an/an/a7.222
GSK
Assay Description
The compound inhibitory activity was determined by incubation with purified PLK enzyme and biotinylated peptide substrate in the presence ATP/[gamma-...
Bioorg Med Chem Lett 19: 1694-7 (2009)
Article DOI: 10.1016/j.bmcl.2009.01.094
BindingDB Entry DOI: 10.7270/Q2319T6X
Serine/threonine-protein kinase PLK1
(Homo sapiens (Human))
BDBM28215
(5-[6-(piperidin-4-yloxy)-1H-1,3-benzodiazol-1-yl]-...)
Show SMILES C[C@@H](Oc1cc(sc1C(N)=O)-n1cnc2ccc(OC3CCNCC3)cc12)c1ccccc1C(F)(F)F |r|
Show InChI InChI=1S/C26H25F3N4O3S/c1-15(18-4-2-3-5-19(18)26(27,28)29)35-22-13-23(37-24(22)25(30)34)33-14-32-20-7-6-17(12-21(20)33)36-16-8-10-31-11-9-16/h2-7,12-16,31H,8-11H2,1H3,(H2,30,34)/t15-/m1/s1
NCI pathway
Reactome pathway
n/an/a 3n/an/an/an/a7.222
GSK
Assay Description
The compound inhibitory activity was determined by incubation with purified PLK enzyme and biotinylated peptide substrate in the presence ATP/[gamma-...
Bioorg Med Chem Lett 19: 1694-7 (2009)
Article DOI: 10.1016/j.bmcl.2009.01.094
BindingDB Entry DOI: 10.7270/Q2319T6X