null
SMILES: C[C@@H](Oc1cc(sc1C(N)=O)-n1cnc2ccc(O[C@@H]3CCCN(C)CC3)cc12)c1ccccc1Cl
InChI Key: InChIKey=HLHNFPFYQRRGPP-QZTJIDSGSA-N
Activity Spreadsheet -- Enzyme Inhibition Constant Data from BindingDB
Found 2 hits for monomerid = 28219
Trg + Lig
Ki
nM
ΔG°
kcal/mole
IC50
nM
Kd
nM
EC50/IC50
nM
koff
s-1
kon
M-1s-1
pHTemp
°C
Serine/threonine-protein kinase PLK3
(Homo sapiens (Human))
BDBM28219
(3-[(1R)-1-(2-chlorophenyl)ethoxy]-5-(6-{[(4R)-1-me...)
Show SMILES C[C@@H](Oc1cc(sc1C(N)=O)-n1cnc2ccc(O[C@@H]3CCCN(C)CC3)cc12)c1ccccc1Cl |r|
Show InChI InChI=1S/C27H29ClN4O3S/c1-17(20-7-3-4-8-21(20)28)34-24-15-25(36-26(24)27(29)33)32-16-30-22-10-9-19(14-23(22)32)35-18-6-5-12-31(2)13-11-18/h3-4,7-10,14-18H,5-6,11-13H2,1-2H3,(H2,29,33)/t17-,18-/m1/s1
NCI pathway
n/an/a 250n/an/an/an/a7.222
GSK
Assay Description
The compound inhibitory activity was determined by incubation with purified PLK enzyme and biotinylated peptide substrate in the presence ATP/[gamma-...
Bioorg Med Chem Lett 19: 1694-7 (2009)
Article DOI: 10.1016/j.bmcl.2009.01.094
BindingDB Entry DOI: 10.7270/Q2319T6X
Serine/threonine-protein kinase PLK1
(Homo sapiens (Human))
BDBM28219
(3-[(1R)-1-(2-chlorophenyl)ethoxy]-5-(6-{[(4R)-1-me...)
Show SMILES C[C@@H](Oc1cc(sc1C(N)=O)-n1cnc2ccc(O[C@@H]3CCCN(C)CC3)cc12)c1ccccc1Cl |r|
Show InChI InChI=1S/C27H29ClN4O3S/c1-17(20-7-3-4-8-21(20)28)34-24-15-25(36-26(24)27(29)33)32-16-30-22-10-9-19(14-23(22)32)35-18-6-5-12-31(2)13-11-18/h3-4,7-10,14-18H,5-6,11-13H2,1-2H3,(H2,29,33)/t17-,18-/m1/s1
NCI pathway
Reactome pathway
n/an/a 4n/an/an/an/a7.222
GSK
Assay Description
The compound inhibitory activity was determined by incubation with purified PLK enzyme and biotinylated peptide substrate in the presence ATP/[gamma-...
Bioorg Med Chem Lett 19: 1694-7 (2009)
Article DOI: 10.1016/j.bmcl.2009.01.094
BindingDB Entry DOI: 10.7270/Q2319T6X