BDBM28239 2-(7-{5-[(4-fluorophenyl)methyl]-1,3,4-oxadiazol-2-yl}-8-hydroxy-1,6-naphthyridin-5-yl)-1,2-thiazinane-1,1-dione::BMCL191807 Compound 2::C5-sultam substituted naphthyridine, 33
SMILES: Oc1c(nc(N2CCCCS2(=O)=O)c2cccnc12)-c1nnc(Cc2ccc(F)cc2)o1
InChI Key: InChIKey=PKDXCDDPOQGIND-UHFFFAOYSA-N
Data: 2 IC50
Activity Spreadsheet -- Enzyme Inhibition Constant Data from BindingDB
Found 2 hits for monomerid = 28239
Trg + Lig
Ki
nM
ΔG°
kcal/mole
IC50
nM
Kd
nM
EC50/IC50
nM
koff
s-1
kon
M-1s-1
pHTemp
°C
HIV-1 Integrase
(Human immunodeficiency virus type 1)
BDBM28239
(2-(7-{5-[(4-fluorophenyl)methyl]-1,3,4-oxadiazol-2...)
Show SMILES Oc1c(nc(N2CCCCS2(=O)=O)c2cccnc12)-c1nnc(Cc2ccc(F)cc2)o1
Show InChI InChI=1S/C21H18FN5O4S/c22-14-7-5-13(6-8-14)12-16-25-26-21(31-16)18-19(28)17-15(4-3-9-23-17)20(24-18)27-10-1-2-11-32(27,29)30/h3-9,28H,1-2,10-12H2
n/an/a 2n/an/an/an/a7.237
GSK
Assay Description
Purified recombinant integrase was first combined in a complex with biotinylated donor DNA- streptavidin-coated SPA beads. The complex was preincubat...
Bioorg Med Chem Lett 19: 1802-6 (2009)
Article DOI: 10.1016/j.bmcl.2009.01.090
BindingDB Entry DOI: 10.7270/Q2Z899QM
HIV-1 Integrase
(Human immunodeficiency virus type 1)
BDBM28239
(2-(7-{5-[(4-fluorophenyl)methyl]-1,3,4-oxadiazol-2...)
Show SMILES Oc1c(nc(N2CCCCS2(=O)=O)c2cccnc12)-c1nnc(Cc2ccc(F)cc2)o1
Show InChI InChI=1S/C21H18FN5O4S/c22-14-7-5-13(6-8-14)12-16-25-26-21(31-16)18-19(28)17-15(4-3-9-23-17)20(24-18)27-10-1-2-11-32(27,29)30/h3-9,28H,1-2,10-12H2
n/an/a 2n/an/an/an/an/an/a
GSK
Assay Description
Purified recombinant integrase was first combined in a complex with biotinylated donor DNA- streptavidin-coated SPA beads. The complex was preincubat...
Bioorg Med Chem Lett 19: 1807-10 (2009)
Article DOI: 10.1016/j.bmcl.2009.01.089
BindingDB Entry DOI: 10.7270/Q2TH8K1R