BDBM28274 1,3,4-oxadiazole substituted naphthyridine, 42::4-(7-{5-[(4-fluorophenyl)methyl]-1,3,4-oxadiazol-2-yl}-8-hydroxy-1,6-naphthyridin-5-yl)benzoic acid
SMILES: OC(=O)c1ccc(cc1)-c1nc(-c2nnc(Cc3ccc(F)cc3)o2)c(O)c2ncccc12
InChI Key: InChIKey=OAGRTSABNXXFBS-UHFFFAOYSA-N
Data: 1 IC50
Activity Spreadsheet -- Enzyme Inhibition Constant Data from BindingDB
Found 1 hit for monomerid = 28274
Trg + Lig
Ki
nM
ΔG°
kcal/mole
IC50
nM
Kd
nM
EC50/IC50
nM
koff
s-1
kon
M-1s-1
pHTemp
°C
HIV-1 Integrase
(Human immunodeficiency virus type 1)
BDBM28274
(1,3,4-oxadiazole substituted naphthyridine, 42 | 4...)
Show SMILES OC(=O)c1ccc(cc1)-c1nc(-c2nnc(Cc3ccc(F)cc3)o2)c(O)c2ncccc12
Show InChI InChI=1S/C24H15FN4O4/c25-16-9-3-13(4-10-16)12-18-28-29-23(33-18)21-22(30)20-17(2-1-11-26-20)19(27-21)14-5-7-15(8-6-14)24(31)32/h1-11,30H,12H2,(H,31,32)
n/an/a 2n/an/an/an/an/an/a
GSK
Assay Description
Purified recombinant integrase was first combined in a complex with biotinylated donor DNA- streptavidin-coated SPA beads. The complex was preincubat...
Bioorg Med Chem Lett 19: 1807-10 (2009)
Article DOI: 10.1016/j.bmcl.2009.01.089
BindingDB Entry DOI: 10.7270/Q2TH8K1R