BDBM282844 6-(4-(3-chloro-4-fluorophenyl)-1-isopropyl-1H- imidazol-5-yl)imidazo[1,2-b]pyridazine-3-carbonitrile::US10287295, Example 51'::US9884868, Example 51'
SMILES: CC(C)n1cnc(c1-c1ccc2ncc(C#N)n2n1)-c1ccc(F)c(Cl)c1
InChI Key: InChIKey=GPNGJZBLLOELBK-UHFFFAOYSA-N
Data: 4 IC50
Activity Spreadsheet -- Enzyme Inhibition Constant Data from BindingDB
Found 4 hits for monomerid = 282844
Trg + Lig
Ki
nM
ΔG°
kcal/mole
IC50
nM
Kd
nM
EC50/IC50
nM
koff
s-1
kon
M-1s-1
pHTemp
°C
TGF-beta receptor type-1
(Homo sapiens (Human))
BDBM282844
(6-(4-(3-chloro-4-fluorophenyl)-1-isopropyl-1H- imi...)
Show SMILES CC(C)n1cnc(c1-c1ccc2ncc(C#N)n2n1)-c1ccc(F)c(Cl)c1
Show InChI InChI=1S/C19H14ClFN6/c1-11(2)26-10-24-18(12-3-4-15(21)14(20)7-12)19(26)16-5-6-17-23-9-13(8-22)27(17)25-16/h3-7,9-11H,1-2H3
US Patent
n/an/a 0.600n/an/an/an/a7.425
Rigel Pharmaceuticals, Inc.; Bristol-Myers Squibb Company
US Patent
Assay Description
Assays for the compounds reported below were conducted in 1536-well plates and 2 mL reactions are prepared from addition of HIS-TGF-βR1 T204D or...
US Patent US9884868 (2018)
BindingDB Entry DOI: 10.7270/Q20P122M
TGF-beta receptor type II
(Homo sapiens (Human))
BDBM282844
(6-(4-(3-chloro-4-fluorophenyl)-1-isopropyl-1H- imi...)
Show SMILES CC(C)n1cnc(c1-c1ccc2ncc(C#N)n2n1)-c1ccc(F)c(Cl)c1
Show InChI InChI=1S/C19H14ClFN6/c1-11(2)26-10-24-18(12-3-4-15(21)14(20)7-12)19(26)16-5-6-17-23-9-13(8-22)27(17)25-16/h3-7,9-11H,1-2H3
NCI pathway
Reactome pathway
US Patent
n/an/a 1.99E+3n/an/an/an/an/an/a
University of Wisconsin at Madison
Assay Description
Assays for the compounds reported below were conducted in 1536-well plates and 2 mL reactions are prepared from addition of HIS-TGF-βR1 T204D or...
J Med Chem 51: 7243-52 (2008)
BindingDB Entry DOI: 10.7270/Q2B85BFB
TGF-betaR1 T204D
(Homo sapiens (Human))
BDBM282844
(6-(4-(3-chloro-4-fluorophenyl)-1-isopropyl-1H- imi...)
Show SMILES CC(C)n1cnc(c1-c1ccc2ncc(C#N)n2n1)-c1ccc(F)c(Cl)c1
Show InChI InChI=1S/C19H14ClFN6/c1-11(2)26-10-24-18(12-3-4-15(21)14(20)7-12)19(26)16-5-6-17-23-9-13(8-22)27(17)25-16/h3-7,9-11H,1-2H3
NCI pathway
Reactome pathway
US Patent
n/an/a 0.600n/an/an/an/an/an/a
University of Wisconsin at Madison
Assay Description
Assays for the compounds reported below were conducted in 1536-well plates and 2 mL reactions are prepared from addition of HIS-TGF-βR1 T204D or...
J Med Chem 51: 7243-52 (2008)
BindingDB Entry DOI: 10.7270/Q2B85BFB
TGF-beta receptor type II
(Homo sapiens (Human))
BDBM282844
(6-(4-(3-chloro-4-fluorophenyl)-1-isopropyl-1H- imi...)
Show SMILES CC(C)n1cnc(c1-c1ccc2ncc(C#N)n2n1)-c1ccc(F)c(Cl)c1
Show InChI InChI=1S/C19H14ClFN6/c1-11(2)26-10-24-18(12-3-4-15(21)14(20)7-12)19(26)16-5-6-17-23-9-13(8-22)27(17)25-16/h3-7,9-11H,1-2H3
NCI pathway
Reactome pathway
US Patent
n/an/a 1.99E+3n/an/an/an/an/an/a
Rigel Pharmaceuticals, Inc.; Bristol-Myers Squibb Company
US Patent
US Patent US9884868 (2018)
BindingDB Entry DOI: 10.7270/Q20P122M