BDBM283007 6-(1-(2,2-difluoroethyl)-4-(4-fluorophenyl)-1H- imidazol-5-yl)-N-methoxyimidazo[1,2-b]pyridazine-3- carboxamide::US10287295, Example 209'::US9884868, Example 209'
SMILES: CONC(=O)c1cnc2ccc(nn12)-c1c(ncn1CC(F)F)-c1ccc(F)cc1
InChI Key: InChIKey=RWDMPAOHRFJLAV-UHFFFAOYSA-N
Data: 4 IC50
Activity Spreadsheet -- Enzyme Inhibition Constant Data from BindingDB
Found 4 hits for monomerid = 283007
Trg + Lig
Ki
nM
ΔG°
kcal/mole
IC50
nM
Kd
nM
EC50/IC50
nM
koff
s-1
kon
M-1s-1
pHTemp
°C
TGF-beta receptor type-1
(Homo sapiens (Human))
BDBM283007
(6-(1-(2,2-difluoroethyl)-4-(4-fluorophenyl)-1H- im...)
Show SMILES CONC(=O)c1cnc2ccc(nn12)-c1c(ncn1CC(F)F)-c1ccc(F)cc1
Show InChI InChI=1S/C19H15F3N6O2/c1-30-26-19(29)14-8-23-16-7-6-13(25-28(14)16)18-17(11-2-4-12(20)5-3-11)24-10-27(18)9-15(21)22/h2-8,10,15H,9H2,1H3,(H,26,29)
US Patent
n/an/a 0.700n/an/an/an/a7.425
Rigel Pharmaceuticals, Inc.; Bristol-Myers Squibb Company
US Patent
Assay Description
Assays for the compounds reported below were conducted in 1536-well plates and 2 mL reactions are prepared from addition of HIS-TGF-βR1 T204D or...
US Patent US9884868 (2018)
BindingDB Entry DOI: 10.7270/Q20P122M
TGF-beta receptor type II
(Homo sapiens (Human))
BDBM283007
(6-(1-(2,2-difluoroethyl)-4-(4-fluorophenyl)-1H- im...)
Show SMILES CONC(=O)c1cnc2ccc(nn12)-c1c(ncn1CC(F)F)-c1ccc(F)cc1
Show InChI InChI=1S/C19H15F3N6O2/c1-30-26-19(29)14-8-23-16-7-6-13(25-28(14)16)18-17(11-2-4-12(20)5-3-11)24-10-27(18)9-15(21)22/h2-8,10,15H,9H2,1H3,(H,26,29)
NCI pathway
Reactome pathway
US Patent
n/an/a 2.68E+3n/an/an/an/an/an/a
University of Wisconsin at Madison
Assay Description
Assays for the compounds reported below were conducted in 1536-well plates and 2 mL reactions are prepared from addition of HIS-TGF-βR1 T204D or...
J Med Chem 51: 7243-52 (2008)
BindingDB Entry DOI: 10.7270/Q2B85BFB
TGF-betaR1 T204D
(Homo sapiens (Human))
BDBM283007
(6-(1-(2,2-difluoroethyl)-4-(4-fluorophenyl)-1H- im...)
Show SMILES CONC(=O)c1cnc2ccc(nn12)-c1c(ncn1CC(F)F)-c1ccc(F)cc1
Show InChI InChI=1S/C19H15F3N6O2/c1-30-26-19(29)14-8-23-16-7-6-13(25-28(14)16)18-17(11-2-4-12(20)5-3-11)24-10-27(18)9-15(21)22/h2-8,10,15H,9H2,1H3,(H,26,29)
NCI pathway
Reactome pathway
US Patent
n/an/a 0.700n/an/an/an/an/an/a
University of Wisconsin at Madison
Assay Description
Assays for the compounds reported below were conducted in 1536-well plates and 2 mL reactions are prepared from addition of HIS-TGF-βR1 T204D or...
J Med Chem 51: 7243-52 (2008)
BindingDB Entry DOI: 10.7270/Q2B85BFB
TGF-beta receptor type II
(Homo sapiens (Human))
BDBM283007
(6-(1-(2,2-difluoroethyl)-4-(4-fluorophenyl)-1H- im...)
Show SMILES CONC(=O)c1cnc2ccc(nn12)-c1c(ncn1CC(F)F)-c1ccc(F)cc1
Show InChI InChI=1S/C19H15F3N6O2/c1-30-26-19(29)14-8-23-16-7-6-13(25-28(14)16)18-17(11-2-4-12(20)5-3-11)24-10-27(18)9-15(21)22/h2-8,10,15H,9H2,1H3,(H,26,29)
NCI pathway
Reactome pathway
US Patent
n/an/a 2.68E+3n/an/an/an/an/an/a
Rigel Pharmaceuticals, Inc.; Bristol-Myers Squibb Company
US Patent
US Patent US9884868 (2018)
BindingDB Entry DOI: 10.7270/Q20P122M