BDBM283150 N-[1-{N-[4-chloro-3-(difluoromethoxy)phenyl]-N′-cyanocarbamimidoyl}-3-(3,4-dichlorophenyl)-4,5-dihydro-1H-pyrazol-4-yl]-N-ethyl-2-hydroxyacetamide Isomer 1::US10023539, Example 11.1::US10023539, Example 11.2
SMILES: CCN(C1CN(N=C1c1ccc(Cl)c(Cl)c1)C(\Nc1ccc(Cl)c(OC(F)F)c1)=N/C#N)C(=O)CO
InChI Key: InChIKey=GAPYHYWZUSFPBS-UHFFFAOYSA-N
Data: 2 IC50
Activity Spreadsheet -- Enzyme Inhibition Constant Data from BindingDB
Found 2 hits for monomerid = 283150
Trg + Lig
Ki
nM
ΔG°
kcal/mole
IC50
nM
Kd
nM
EC50/IC50
nM
koff
s-1
kon
M-1s-1
pHTemp
°C
N-lysine methyltransferase SMYD2
(Homo sapiens (Human))
BDBM283150
(N-[1-{N-[4-chloro-3-(difluoromethoxy)phenyl]-NR...)
Show SMILES CCN(C1CN(N=C1c1ccc(Cl)c(Cl)c1)C(\Nc1ccc(Cl)c(OC(F)F)c1)=N/C#N)C(=O)CO |c:6|
Show InChI InChI=1S/C22H19Cl3F2N6O3/c1-2-32(19(35)10-34)17-9-33(31-20(17)12-3-5-14(23)16(25)7-12)22(29-11-28)30-13-4-6-15(24)18(8-13)36-21(26)27/h3-8,17,21,34H,2,9-10H2,1H3,(H,29,30)
US Patent
n/an/a 2.98E+3n/an/an/an/a9.0n/a
Bayer Pharma Aktiengesellschaft
US Patent
Assay Description
SMYD2 inhibitory activities of the compounds described in the present invention were quantified using a scintillation proximity assay (SPA) which mea...
US Patent US10023539 (2018)
BindingDB Entry DOI: 10.7270/Q2MG7RKD
N-lysine methyltransferase SMYD2
(Homo sapiens (Human))
BDBM283150
(N-[1-{N-[4-chloro-3-(difluoromethoxy)phenyl]-NR...)
Show SMILES CCN(C1CN(N=C1c1ccc(Cl)c(Cl)c1)C(\Nc1ccc(Cl)c(OC(F)F)c1)=N/C#N)C(=O)CO |c:6|
Show InChI InChI=1S/C22H19Cl3F2N6O3/c1-2-32(19(35)10-34)17-9-33(31-20(17)12-3-5-14(23)16(25)7-12)22(29-11-28)30-13-4-6-15(24)18(8-13)36-21(26)27/h3-8,17,21,34H,2,9-10H2,1H3,(H,29,30)
US Patent
n/an/a 44.1n/an/an/an/a9.0n/a
Bayer Pharma Aktiengesellschaft
US Patent
Assay Description
SMYD2 inhibitory activities of the compounds described in the present invention were quantified using a scintillation proximity assay (SPA) which mea...
US Patent US10023539 (2018)
BindingDB Entry DOI: 10.7270/Q2MG7RKD