null
SMILES: CCN(C1CN(N=C1c1ccc(Cl)c(Cl)c1)C(\Nc1cc(ccc1OC1CCN(C)CC1)C(F)(F)F)=N/C#N)C(=O)CO
InChI Key: InChIKey=POSDRPCYJOVLGC-UHFFFAOYSA-N
Activity Spreadsheet -- Enzyme Inhibition Constant Data from BindingDB
Found 2 hits for monomerid = 283196
Trg + Lig
Ki
nM
ΔG°
kcal/mole
IC50
nM
Kd
nM
EC50/IC50
nM
koff
s-1
kon
M-1s-1
pHTemp
°C
N-lysine methyltransferase SMYD2
(Homo sapiens (Human))
BDBM283196
(Rac-N-[1-(N′-cyano-N-{2-[(1-methylpiperidin-...)
Show SMILES CCN(C1CN(N=C1c1ccc(Cl)c(Cl)c1)C(\Nc1cc(ccc1OC1CCN(C)CC1)C(F)(F)F)=N/C#N)C(=O)CO |w:3.2,c:6|
Show InChI InChI=1S/C28H30Cl2F3N7O3/c1-3-39(25(42)15-41)23-14-40(37-26(23)17-4-6-20(29)21(30)12-17)27(35-16-34)36-22-13-18(28(31,32)33)5-7-24(22)43-19-8-10-38(2)11-9-19/h4-7,12-13,19,23,41H,3,8-11,14-15H2,1-2H3,(H,35,36)
US Patent
n/an/a 126n/an/an/an/an/an/a
Bayer Pharma Aktiengesellschaft
US Patent
Assay Description
For the detection of SMYD2 cellular methylation activity an In Cell Western (ICW) assay was established. This assay allows rapid processing of multip...
US Patent US10023539 (2018)
BindingDB Entry DOI: 10.7270/Q2MG7RKD
N-lysine methyltransferase SMYD2
(Homo sapiens (Human))
BDBM283196
(Rac-N-[1-(N′-cyano-N-{2-[(1-methylpiperidin-...)
Show SMILES CCN(C1CN(N=C1c1ccc(Cl)c(Cl)c1)C(\Nc1cc(ccc1OC1CCN(C)CC1)C(F)(F)F)=N/C#N)C(=O)CO |w:3.2,c:6|
Show InChI InChI=1S/C28H30Cl2F3N7O3/c1-3-39(25(42)15-41)23-14-40(37-26(23)17-4-6-20(29)21(30)12-17)27(35-16-34)36-22-13-18(28(31,32)33)5-7-24(22)43-19-8-10-38(2)11-9-19/h4-7,12-13,19,23,41H,3,8-11,14-15H2,1-2H3,(H,35,36)
US Patent
n/an/a 9.09n/an/an/an/a9.0n/a
Bayer Pharma Aktiengesellschaft
US Patent
Assay Description
SMYD2 inhibitory activities of the compounds described in the present invention were quantified using a scintillation proximity assay (SPA) which mea...
US Patent US10023539 (2018)
BindingDB Entry DOI: 10.7270/Q2MG7RKD