BDBM283208 N-[1-{N′-cyano-N-[3-(difluoromethoxy)phenyl]carbamimidoyl}-3-(3,4-dichlorophenyl)-4,5-dihydro-1H-pyrazol-4-yl]-3-methyl-D-isovalinamide::US10023539, Example 38
SMILES: CC(C)[C@@](C)(N)C(=O)NC1CN(N=C1c1ccc(Cl)c(Cl)c1)C(\Nc1cccc(OC(F)F)c1)=N/C#N
InChI Key: InChIKey=LOSHHNPLLHQJII-JKSFWZLDSA-N
Data: 2 IC50
Activity Spreadsheet -- Enzyme Inhibition Constant Data from BindingDB
Found 2 hits for monomerid = 283208
Trg + Lig
Ki
nM
ΔG°
kcal/mole
IC50
nM
Kd
nM
EC50/IC50
nM
koff
s-1
kon
M-1s-1
pHTemp
°C
N-lysine methyltransferase SMYD2
(Homo sapiens (Human))
BDBM283208
(N-[1-{N′-cyano-N-[3-(difluoromethoxy)phenyl]...)
Show SMILES CC(C)[C@@](C)(N)C(=O)NC1CN(N=C1c1ccc(Cl)c(Cl)c1)C(\Nc1cccc(OC(F)F)c1)=N/C#N |r,w:9.8,c:12|
Show InChI InChI=1S/C24H25Cl2F2N7O2/c1-13(2)24(3,30)21(36)33-19-11-35(34-20(19)14-7-8-17(25)18(26)9-14)23(31-12-29)32-15-5-4-6-16(10-15)37-22(27)28/h4-10,13,19,22H,11,30H2,1-3H3,(H,31,32)(H,33,36)/t19?,24-/m1/s1
US Patent
n/an/a 37.2n/an/an/an/an/an/a
Bayer Pharma Aktiengesellschaft
US Patent
Assay Description
For the detection of SMYD2 cellular methylation activity an In Cell Western (ICW) assay was established. This assay allows rapid processing of multip...
US Patent US10023539 (2018)
BindingDB Entry DOI: 10.7270/Q2MG7RKD
N-lysine methyltransferase SMYD2
(Homo sapiens (Human))
BDBM283208
(N-[1-{N′-cyano-N-[3-(difluoromethoxy)phenyl]...)
Show SMILES CC(C)[C@@](C)(N)C(=O)NC1CN(N=C1c1ccc(Cl)c(Cl)c1)C(\Nc1cccc(OC(F)F)c1)=N/C#N |r,w:9.8,c:12|
Show InChI InChI=1S/C24H25Cl2F2N7O2/c1-13(2)24(3,30)21(36)33-19-11-35(34-20(19)14-7-8-17(25)18(26)9-14)23(31-12-29)32-15-5-4-6-16(10-15)37-22(27)28/h4-10,13,19,22H,11,30H2,1-3H3,(H,31,32)(H,33,36)/t19?,24-/m1/s1
US Patent
n/an/a 32n/an/an/an/a9.0n/a
Bayer Pharma Aktiengesellschaft
US Patent
Assay Description
SMYD2 inhibitory activities of the compounds described in the present invention were quantified using a scintillation proximity assay (SPA) which mea...
US Patent US10023539 (2018)
BindingDB Entry DOI: 10.7270/Q2MG7RKD