BDBM283233 2-fluoro-4-[1-methyl-2- (4-methylamino-piperidin-1-yl)-5- (6-methyl-pyridin-3-yl)-6-oxo- 1,6-dihydro-pyrimidin-4-yl]- benzonitrile::US10023543, Example 21::US10207999, Example 21::US10328077, Example 21::US10548896, Example 21::US10849898, Example 21::US10960005, Example 21::US9573930, Example 21::US9771329, Example 21::US9776974, Example 21
SMILES: CNC1CCN(CC1)c1nc(-c2ccc(C#N)c(F)c2)c(-c2ccc(C)nc2)c(=O)n1C
InChI Key: InChIKey=SPMNEKSEMCYUKT-UHFFFAOYSA-N
Data: 10 IC50
Activity Spreadsheet -- Enzyme Inhibition Constant Data from BindingDB
Found 11 hits for monomerid = 283233
Trg + Lig
Ki
nM
ΔG°
kcal/mole
IC50
nM
Kd
nM
EC50/IC50
nM
koff
s-1
kon
M-1s-1
pHTemp
°C
Lysine-specific histone demethylase 1A
(Homo sapiens (Human))
BDBM283233
(2-fluoro-4-[1-methyl-2- (4-methylamino-piperidin-1...)
Show SMILES CNC1CCN(CC1)c1nc(-c2ccc(C#N)c(F)c2)c(-c2ccc(C)nc2)c(=O)n1C
Show InChI InChI=1S/C24H25FN6O/c1-15-4-5-18(14-28-15)21-22(16-6-7-17(13-26)20(25)12-16)29-24(30(3)23(21)32)31-10-8-19(27-2)9-11-31/h4-7,12,14,19,27H,8-11H2,1-3H3
Reactome pathway
US Patent
n/an/a<100n/an/an/an/an/a25
CELGENE QUANTICEL RESEARCH, INC.
US Patent
Assay Description
This assay determines the ability of a test compound to inhibit LSD1 demethylase activity. E. coli expressed full-length human LSD1 (Accession number...
US Patent US10023543 (2018)
BindingDB Entry DOI: 10.7270/Q2GQ70TM
Lysine-specific histone demethylase 1A
(Homo sapiens (Human))
BDBM283233
(2-fluoro-4-[1-methyl-2- (4-methylamino-piperidin-1...)
Show SMILES CNC1CCN(CC1)c1nc(-c2ccc(C#N)c(F)c2)c(-c2ccc(C)nc2)c(=O)n1C
Show InChI InChI=1S/C24H25FN6O/c1-15-4-5-18(14-28-15)21-22(16-6-7-17(13-26)20(25)12-16)29-24(30(3)23(21)32)31-10-8-19(27-2)9-11-31/h4-7,12,14,19,27H,8-11H2,1-3H3
Reactome pathway
US Patent
n/an/a<100n/an/an/an/an/a25
Celgene Quanticel Research, Inc.
US Patent
Assay Description
This assay determines the ability of a test compound to inhibit LSD1 demethylase activity. E. coli expressed full-length human LSD1 (Accession number...
US Patent US9573930 (2017)
BindingDB Entry DOI: 10.7270/Q2H70HV3
Lysine-specific histone demethylase 1A
(Homo sapiens (Human))
BDBM283233
(2-fluoro-4-[1-methyl-2- (4-methylamino-piperidin-1...)
Show SMILES CNC1CCN(CC1)c1nc(-c2ccc(C#N)c(F)c2)c(-c2ccc(C)nc2)c(=O)n1C
Show InChI InChI=1S/C24H25FN6O/c1-15-4-5-18(14-28-15)21-22(16-6-7-17(13-26)20(25)12-16)29-24(30(3)23(21)32)31-10-8-19(27-2)9-11-31/h4-7,12,14,19,27H,8-11H2,1-3H3
Reactome pathway
US Patent
n/an/a<100n/an/an/an/an/an/a
Celgene Quanticel Research, Inc.
US Patent
Assay Description
The enzymatic assay of LSD1 activity is based on Time Resolved-Fluorescence Resonance Energy Transfer (TR-FRET) detection. The inhibitory properties ...
US Patent US9776974 (2017)
BindingDB Entry DOI: 10.7270/Q2BZ686N
Lysine-specific histone demethylase 1A
(Homo sapiens (Human))
BDBM283233
(2-fluoro-4-[1-methyl-2- (4-methylamino-piperidin-1...)
Show SMILES CNC1CCN(CC1)c1nc(-c2ccc(C#N)c(F)c2)c(-c2ccc(C)nc2)c(=O)n1C
Show InChI InChI=1S/C24H25FN6O/c1-15-4-5-18(14-28-15)21-22(16-6-7-17(13-26)20(25)12-16)29-24(30(3)23(21)32)31-10-8-19(27-2)9-11-31/h4-7,12,14,19,27H,8-11H2,1-3H3
Reactome pathway
US Patent
n/an/a<100n/an/an/an/an/an/a
Celgene Quanticel Research, Inc.
US Patent
Assay Description
The enzymatic assay of LSD1 activity is based on Time Resolved-Fluorescence Resonance Energy Transfer (TR-FRET) detection. The inhibitory properties ...
US Patent US9771329 (2017)
BindingDB Entry DOI: 10.7270/Q2NG4SR7
Lysine-specific histone demethylase 1A
(Homo sapiens (Human))
BDBM283233
(2-fluoro-4-[1-methyl-2- (4-methylamino-piperidin-1...)
Show SMILES CNC1CCN(CC1)c1nc(-c2ccc(C#N)c(F)c2)c(-c2ccc(C)nc2)c(=O)n1C
Show InChI InChI=1S/C24H25FN6O/c1-15-4-5-18(14-28-15)21-22(16-6-7-17(13-26)20(25)12-16)29-24(30(3)23(21)32)31-10-8-19(27-2)9-11-31/h4-7,12,14,19,27H,8-11H2,1-3H3
Reactome pathway
US Patent
n/an/a<100n/an/an/an/an/an/a
Duquesne University
Assay Description
This assay determines the ability of a test compound to inhibit LSD-1 demethylase activity. E. coli expressed full-length human LSD-1 (Accession numb...
Bioorg Med Chem 17: 7324-36 (2009)
BindingDB Entry DOI: 10.7270/Q2W66P3N
Lysine-specific histone demethylase 1A
(Homo sapiens (Human))
BDBM283233
(2-fluoro-4-[1-methyl-2- (4-methylamino-piperidin-1...)
Show SMILES CNC1CCN(CC1)c1nc(-c2ccc(C#N)c(F)c2)c(-c2ccc(C)nc2)c(=O)n1C
Show InChI InChI=1S/C24H25FN6O/c1-15-4-5-18(14-28-15)21-22(16-6-7-17(13-26)20(25)12-16)29-24(30(3)23(21)32)31-10-8-19(27-2)9-11-31/h4-7,12,14,19,27H,8-11H2,1-3H3
Reactome pathway
n/an/a<100n/an/an/an/an/an/a
TBA
Citation and Details
Lysine-specific histone demethylase 1A
(Homo sapiens (Human))
BDBM283233
(2-fluoro-4-[1-methyl-2- (4-methylamino-piperidin-1...)
Show SMILES CNC1CCN(CC1)c1nc(-c2ccc(C#N)c(F)c2)c(-c2ccc(C)nc2)c(=O)n1C
Show InChI InChI=1S/C24H25FN6O/c1-15-4-5-18(14-28-15)21-22(16-6-7-17(13-26)20(25)12-16)29-24(30(3)23(21)32)31-10-8-19(27-2)9-11-31/h4-7,12,14,19,27H,8-11H2,1-3H3
Reactome pathway
US Patent
n/an/a<100n/an/an/an/an/an/a
Celgene Quanticel Research, Inc.
US Patent
Assay Description
This assay determines the ability of a test compound to inhibit LSD-1 demethylase activity. E. coli expressed full-length human LSD-1 (Accession numb...
US Patent US10543213 (2020)
BindingDB Entry DOI: 10.7270/Q2X63QBC
Lysine-specific histone demethylase 1A
(Homo sapiens (Human))
BDBM283233
(2-fluoro-4-[1-methyl-2- (4-methylamino-piperidin-1...)
Show SMILES CNC1CCN(CC1)c1nc(-c2ccc(C#N)c(F)c2)c(-c2ccc(C)nc2)c(=O)n1C
Show InChI InChI=1S/C24H25FN6O/c1-15-4-5-18(14-28-15)21-22(16-6-7-17(13-26)20(25)12-16)29-24(30(3)23(21)32)31-10-8-19(27-2)9-11-31/h4-7,12,14,19,27H,8-11H2,1-3H3
Reactome pathway
US Patent
n/an/a<100n/an/an/an/an/an/a
Celgene Quanticel Research, Inc.
US Patent
Assay Description
This assay determines the ability of a test compound to inhibit LSD-1 demethylase activity. E. coli expressed full-length human LSD-1 (Accession numb...
US Patent US10548896 (2020)
BindingDB Entry DOI: 10.7270/Q29889CV
Lysine-specific histone demethylase 1A
(Homo sapiens (Human))
BDBM283233
(2-fluoro-4-[1-methyl-2- (4-methylamino-piperidin-1...)
Show SMILES CNC1CCN(CC1)c1nc(-c2ccc(C#N)c(F)c2)c(-c2ccc(C)nc2)c(=O)n1C
Show InChI InChI=1S/C24H25FN6O/c1-15-4-5-18(14-28-15)21-22(16-6-7-17(13-26)20(25)12-16)29-24(30(3)23(21)32)31-10-8-19(27-2)9-11-31/h4-7,12,14,19,27H,8-11H2,1-3H3
Reactome pathway
US Patent
n/an/a<100n/an/an/an/an/an/a
CELGENE QUANTICEL RESEARCH, INC.
US Patent
Assay Description
This assay determines the ability of a test compound to inhibit LSD-1 demethylase activity. E. coli expressed full-length human LSD-1 (Accession numb...
US Patent US10849898 (2020)
Lysine-specific histone demethylase 1A
(Homo sapiens (Human))
BDBM283233
(2-fluoro-4-[1-methyl-2- (4-methylamino-piperidin-1...)
Show SMILES CNC1CCN(CC1)c1nc(-c2ccc(C#N)c(F)c2)c(-c2ccc(C)nc2)c(=O)n1C
Show InChI InChI=1S/C24H25FN6O/c1-15-4-5-18(14-28-15)21-22(16-6-7-17(13-26)20(25)12-16)29-24(30(3)23(21)32)31-10-8-19(27-2)9-11-31/h4-7,12,14,19,27H,8-11H2,1-3H3
Reactome pathway
US Patent
n/an/a<100n/an/an/an/an/an/a
CELGENE QUANTICEL RESEARCH, INC.
US Patent
Assay Description
The enzymatic assay of LSD-1 activity is based on Tnne Resolved-Fluorescence Resonance Energy Transfer (TR-FRET) detection. The inhibitory properties...
US Patent US10960005 (2021)
Lysine-specific histone demethylase 1A
(Homo sapiens (Human))
BDBM283233
(2-fluoro-4-[1-methyl-2- (4-methylamino-piperidin-1...)
Show SMILES CNC1CCN(CC1)c1nc(-c2ccc(C#N)c(F)c2)c(-c2ccc(C)nc2)c(=O)n1C
Show InChI InChI=1S/C24H25FN6O/c1-15-4-5-18(14-28-15)21-22(16-6-7-17(13-26)20(25)12-16)29-24(30(3)23(21)32)31-10-8-19(27-2)9-11-31/h4-7,12,14,19,27H,8-11H2,1-3H3
Reactome pathway
US Patent
n/an/a<100n/an/an/an/an/an/a
CELGENE QUANTICEL RESEARCH, INC.
US Patent
Assay Description
This assay determines the ability of a test compound to inhibit LSD1 demethylase activity. E. coli expressed full-length human LSD1 (Accession number...
US Patent US10207999 (2019)
BindingDB Entry DOI: 10.7270/Q2DJ5HRT