BDBM283250 4-[2-(4-amino-piperidin-1-yl)-1- methyl-5-(1-methyl-1H-indazol-5- yl)-6-oxo-1,6-dihydro-pyrimidin- 4-yl]-2-fluoro-benzonitrile::US10023543, Example 35::US10207999, Example 35::US10328077, Example 35::US10548896, Example 35::US10849898, Example 35::US10960005, Example 35::US9573930, Example 35::US9771329, Example 35::US9776974, Example 35
SMILES: Cn1ncc2cc(ccc12)-c1c(nc(N2CCC(N)CC2)n(C)c1=O)-c1ccc(C#N)c(F)c1
InChI Key: InChIKey=IEOVVTJCXFEDKK-UHFFFAOYSA-N
Data: 11 IC50
Activity Spreadsheet -- Enzyme Inhibition Constant Data from BindingDB
Found 11 hits for monomerid = 283250
Trg + Lig
Ki
nM
ΔG°
kcal/mole
IC50
nM
Kd
nM
EC50/IC50
nM
koff
s-1
kon
M-1s-1
pHTemp
°C
Lysine-specific histone demethylase 1A
(Homo sapiens (Human))
BDBM283250
(4-[2-(4-amino-piperidin-1-yl)-1- methyl-5-(1-methy...)
Show SMILES Cn1ncc2cc(ccc12)-c1c(nc(N2CCC(N)CC2)n(C)c1=O)-c1ccc(C#N)c(F)c1
Show InChI InChI=1S/C25H24FN7O/c1-31-24(34)22(15-5-6-21-18(11-15)14-29-32(21)2)23(16-3-4-17(13-27)20(26)12-16)30-25(31)33-9-7-19(28)8-10-33/h3-6,11-12,14,19H,7-10,28H2,1-2H3
Reactome pathway
US Patent
n/an/a<100n/an/an/an/an/a25
CELGENE QUANTICEL RESEARCH, INC.
US Patent
Assay Description
This assay determines the ability of a test compound to inhibit LSD1 demethylase activity. E. coli expressed full-length human LSD1 (Accession number...
US Patent US10023543 (2018)
BindingDB Entry DOI: 10.7270/Q2GQ70TM
Lysine-specific histone demethylase 1A
(Homo sapiens (Human))
BDBM283250
(4-[2-(4-amino-piperidin-1-yl)-1- methyl-5-(1-methy...)
Show SMILES Cn1ncc2cc(ccc12)-c1c(nc(N2CCC(N)CC2)n(C)c1=O)-c1ccc(C#N)c(F)c1
Show InChI InChI=1S/C25H24FN7O/c1-31-24(34)22(15-5-6-21-18(11-15)14-29-32(21)2)23(16-3-4-17(13-27)20(26)12-16)30-25(31)33-9-7-19(28)8-10-33/h3-6,11-12,14,19H,7-10,28H2,1-2H3
Reactome pathway
US Patent
n/an/a<100n/an/an/an/an/a25
Celgene Quanticel Research, Inc.
US Patent
Assay Description
This assay determines the ability of a test compound to inhibit LSD1 demethylase activity. E. coli expressed full-length human LSD1 (Accession number...
US Patent US9573930 (2017)
BindingDB Entry DOI: 10.7270/Q2H70HV3
Lysine-specific histone demethylase 1A
(Homo sapiens (Human))
BDBM283250
(4-[2-(4-amino-piperidin-1-yl)-1- methyl-5-(1-methy...)
Show SMILES Cn1ncc2cc(ccc12)-c1c(nc(N2CCC(N)CC2)n(C)c1=O)-c1ccc(C#N)c(F)c1
Show InChI InChI=1S/C25H24FN7O/c1-31-24(34)22(15-5-6-21-18(11-15)14-29-32(21)2)23(16-3-4-17(13-27)20(26)12-16)30-25(31)33-9-7-19(28)8-10-33/h3-6,11-12,14,19H,7-10,28H2,1-2H3
Reactome pathway
US Patent
n/an/a<100n/an/an/an/an/an/a
Celgene Quanticel Research, Inc.
US Patent
Assay Description
The enzymatic assay of LSD1 activity is based on Time Resolved-Fluorescence Resonance Energy Transfer (TR-FRET) detection. The inhibitory properties ...
US Patent US9776974 (2017)
BindingDB Entry DOI: 10.7270/Q2BZ686N
Lysine-specific histone demethylase 1A
(Homo sapiens (Human))
BDBM283250
(4-[2-(4-amino-piperidin-1-yl)-1- methyl-5-(1-methy...)
Show SMILES Cn1ncc2cc(ccc12)-c1c(nc(N2CCC(N)CC2)n(C)c1=O)-c1ccc(C#N)c(F)c1
Show InChI InChI=1S/C25H24FN7O/c1-31-24(34)22(15-5-6-21-18(11-15)14-29-32(21)2)23(16-3-4-17(13-27)20(26)12-16)30-25(31)33-9-7-19(28)8-10-33/h3-6,11-12,14,19H,7-10,28H2,1-2H3
Reactome pathway
US Patent
n/an/a<100n/an/an/an/an/an/a
Celgene Quanticel Research, Inc.
US Patent
Assay Description
The enzymatic assay of LSD1 activity is based on Time Resolved-Fluorescence Resonance Energy Transfer (TR-FRET) detection. The inhibitory properties ...
US Patent US9771329 (2017)
BindingDB Entry DOI: 10.7270/Q2NG4SR7
Lysine-specific histone demethylase 1A
(Homo sapiens (Human))
BDBM283250
(4-[2-(4-amino-piperidin-1-yl)-1- methyl-5-(1-methy...)
Show SMILES Cn1ncc2cc(ccc12)-c1c(nc(N2CCC(N)CC2)n(C)c1=O)-c1ccc(C#N)c(F)c1
Show InChI InChI=1S/C25H24FN7O/c1-31-24(34)22(15-5-6-21-18(11-15)14-29-32(21)2)23(16-3-4-17(13-27)20(26)12-16)30-25(31)33-9-7-19(28)8-10-33/h3-6,11-12,14,19H,7-10,28H2,1-2H3
Reactome pathway
US Patent
n/an/a<100n/an/an/an/an/an/a
Duquesne University
Assay Description
This assay determines the ability of a test compound to inhibit LSD-1 demethylase activity. E. coli expressed full-length human LSD-1 (Accession numb...
Bioorg Med Chem 17: 7324-36 (2009)
BindingDB Entry DOI: 10.7270/Q2W66P3N
Lysine-specific histone demethylase 1A
(Homo sapiens (Human))
BDBM283250
(4-[2-(4-amino-piperidin-1-yl)-1- methyl-5-(1-methy...)
Show SMILES Cn1ncc2cc(ccc12)-c1c(nc(N2CCC(N)CC2)n(C)c1=O)-c1ccc(C#N)c(F)c1
Show InChI InChI=1S/C25H24FN7O/c1-31-24(34)22(15-5-6-21-18(11-15)14-29-32(21)2)23(16-3-4-17(13-27)20(26)12-16)30-25(31)33-9-7-19(28)8-10-33/h3-6,11-12,14,19H,7-10,28H2,1-2H3
Reactome pathway
US Patent
n/an/a<100n/an/an/an/an/an/a
CELGENE QUANTICEL RESEARCH, INC.
US Patent
Assay Description
The enzymatic assay of LSD-1 activity is based on Tnne Resolved-Fluorescence Resonance Energy Transfer (TR-FRET) detection. The inhibitory properties...
US Patent US10960005 (2021)
Lysine-specific histone demethylase 1A
(Homo sapiens (Human))
BDBM283250
(4-[2-(4-amino-piperidin-1-yl)-1- methyl-5-(1-methy...)
Show SMILES Cn1ncc2cc(ccc12)-c1c(nc(N2CCC(N)CC2)n(C)c1=O)-c1ccc(C#N)c(F)c1
Show InChI InChI=1S/C25H24FN7O/c1-31-24(34)22(15-5-6-21-18(11-15)14-29-32(21)2)23(16-3-4-17(13-27)20(26)12-16)30-25(31)33-9-7-19(28)8-10-33/h3-6,11-12,14,19H,7-10,28H2,1-2H3
Reactome pathway
US Patent
n/an/a<100n/an/an/an/an/an/a
CELGENE QUANTICEL RESEARCH, INC.
US Patent
Assay Description
To analyze LSD1 inhibitor efficacy in cells, a CD11b flow cytometry assay was performed. LSD1 inhibition induces CD11b expression in THP-1 (AML) cell...
US Patent US10207999 (2019)
BindingDB Entry DOI: 10.7270/Q2DJ5HRT
Lysine-specific histone demethylase 1A
(Homo sapiens (Human))
BDBM283250
(4-[2-(4-amino-piperidin-1-yl)-1- methyl-5-(1-methy...)
Show SMILES Cn1ncc2cc(ccc12)-c1c(nc(N2CCC(N)CC2)n(C)c1=O)-c1ccc(C#N)c(F)c1
Show InChI InChI=1S/C25H24FN7O/c1-31-24(34)22(15-5-6-21-18(11-15)14-29-32(21)2)23(16-3-4-17(13-27)20(26)12-16)30-25(31)33-9-7-19(28)8-10-33/h3-6,11-12,14,19H,7-10,28H2,1-2H3
Reactome pathway
US Patent
n/an/a<100n/an/an/an/an/an/a
Celgene Quanticel Research, Inc.
US Patent
Assay Description
This assay determines the ability of a test compound to inhibit LSD-1 demethylase activity. E. coli expressed full-length human LSD-1 (Accession numb...
US Patent US10543213 (2020)
BindingDB Entry DOI: 10.7270/Q2X63QBC
Lysine-specific histone demethylase 1A
(Homo sapiens (Human))
BDBM283250
(4-[2-(4-amino-piperidin-1-yl)-1- methyl-5-(1-methy...)
Show SMILES Cn1ncc2cc(ccc12)-c1c(nc(N2CCC(N)CC2)n(C)c1=O)-c1ccc(C#N)c(F)c1
Show InChI InChI=1S/C25H24FN7O/c1-31-24(34)22(15-5-6-21-18(11-15)14-29-32(21)2)23(16-3-4-17(13-27)20(26)12-16)30-25(31)33-9-7-19(28)8-10-33/h3-6,11-12,14,19H,7-10,28H2,1-2H3
Reactome pathway
US Patent
n/an/a<100n/an/an/an/an/an/a
Celgene Quanticel Research, Inc.
US Patent
Assay Description
This assay determines the ability of a test compound to inhibit LSD-1 demethylase activity. E. coli expressed full-length human LSD-1 (Accession numb...
US Patent US10548896 (2020)
BindingDB Entry DOI: 10.7270/Q29889CV
Lysine-specific histone demethylase 1A
(Homo sapiens (Human))
BDBM283250
(4-[2-(4-amino-piperidin-1-yl)-1- methyl-5-(1-methy...)
Show SMILES Cn1ncc2cc(ccc12)-c1c(nc(N2CCC(N)CC2)n(C)c1=O)-c1ccc(C#N)c(F)c1
Show InChI InChI=1S/C25H24FN7O/c1-31-24(34)22(15-5-6-21-18(11-15)14-29-32(21)2)23(16-3-4-17(13-27)20(26)12-16)30-25(31)33-9-7-19(28)8-10-33/h3-6,11-12,14,19H,7-10,28H2,1-2H3
Reactome pathway
US Patent
n/an/a<100n/an/an/an/an/an/a
CELGENE QUANTICEL RESEARCH, INC.
US Patent
Assay Description
This assay determines the ability of a test compound to inhibit LSD-1 demethylase activity. E. coli expressed full-length human LSD-1 (Accession numb...
US Patent US10849898 (2020)
Lysine-specific histone demethylase 1A
(Homo sapiens (Human))
BDBM283250
(4-[2-(4-amino-piperidin-1-yl)-1- methyl-5-(1-methy...)
Show SMILES Cn1ncc2cc(ccc12)-c1c(nc(N2CCC(N)CC2)n(C)c1=O)-c1ccc(C#N)c(F)c1
Show InChI InChI=1S/C25H24FN7O/c1-31-24(34)22(15-5-6-21-18(11-15)14-29-32(21)2)23(16-3-4-17(13-27)20(26)12-16)30-25(31)33-9-7-19(28)8-10-33/h3-6,11-12,14,19H,7-10,28H2,1-2H3
Reactome pathway
US Patent
n/an/a<100n/an/an/an/an/an/a
CELGENE QUANTICEL RESEARCH, INC.
US Patent
Assay Description
This assay determines the ability of a test compound to inhibit LSD1 demethylase activity. E. coli expressed full-length human LSD1 (Accession number...
US Patent US10207999 (2019)
BindingDB Entry DOI: 10.7270/Q2DJ5HRT