null
SMILES: Cc1nc(N)ccc1CNC(=O)c1ccnc(Cc2cc(CO)c3ncc(Cl)cc3c2)c1
InChI Key: InChIKey=SCWQNZNCOWHKCU-UHFFFAOYSA-N
Activity Spreadsheet -- Enzyme Inhibition Constant Data from BindingDB
Found 6 hits for monomerid = 283445
Trg + Lig
Ki
nM
ΔG°
kcal/mole
IC50
nM
Kd
nM
EC50/IC50
nM
koff
s-1
kon
M-1s-1
pHTemp
°C
Plasma kallikrein
(Homo sapiens (Human))
BDBM283445
(N-((6-amino-2-methylpyridin-3-yl)methyl)-2- ((3-ch...)
Show SMILES Cc1nc(N)ccc1CNC(=O)c1ccnc(Cc2cc(CO)c3ncc(Cl)cc3c2)c1
Show InChI InChI=1S/C24H22ClN5O2/c1-14-17(2-3-22(26)30-14)11-29-24(32)16-4-5-27-21(10-16)8-15-6-18-9-20(25)12-28-23(18)19(7-15)13-31/h2-7,9-10,12,31H,8,11,13H2,1H3,(H2,26,30)(H,29,32)
US Patent
n/an/a<100n/an/an/an/a7.5n/a
LIFESCI PHARMACEUTICALS, INC.
US Patent
Assay Description
A 10 mM solution of the test compound was made in DMSO. This solution was serially diluted 1:5 in DMSO to yield 2000, 400, 80, 16, 3.2, 0.64, 0.128, ...
US Patent US10023557 (2018)
BindingDB Entry DOI: 10.7270/Q2BZ6839
Plasma kallikrein
(Homo sapiens (Human))
BDBM283445
(N-((6-amino-2-methylpyridin-3-yl)methyl)-2- ((3-ch...)
Show SMILES Cc1nc(N)ccc1CNC(=O)c1ccnc(Cc2cc(CO)c3ncc(Cl)cc3c2)c1
Show InChI InChI=1S/C24H22ClN5O2/c1-14-17(2-3-22(26)30-14)11-29-24(32)16-4-5-27-21(10-16)8-15-6-18-9-20(25)12-28-23(18)19(7-15)13-31/h2-7,9-10,12,31H,8,11,13H2,1H3,(H2,26,30)(H,29,32)
US Patent
n/an/an/an/a<100n/an/an/an/a
LIFESCI PHARMACEUTICALS, INC.
US Patent
Assay Description
The test compounds at various concentrations, also prepared by serial dilutions as described above, are added to the test wells. The volume of test c...
US Patent US10023557 (2018)
BindingDB Entry DOI: 10.7270/Q2BZ6839
Plasma kallikrein
(Homo sapiens (Human))
BDBM283445
(N-((6-amino-2-methylpyridin-3-yl)methyl)-2- ((3-ch...)
Show SMILES Cc1nc(N)ccc1CNC(=O)c1ccnc(Cc2cc(CO)c3ncc(Cl)cc3c2)c1
Show InChI InChI=1S/C24H22ClN5O2/c1-14-17(2-3-22(26)30-14)11-29-24(32)16-4-5-27-21(10-16)8-15-6-18-9-20(25)12-28-23(18)19(7-15)13-31/h2-7,9-10,12,31H,8,11,13H2,1H3,(H2,26,30)(H,29,32)
US Patent
n/an/a<100n/an/an/an/an/an/a
ATTUNE PHARMACEUTICALS, INC.
US Patent
Assay Description
A 10 mM solution of the test compound was made in DMSO. This solution was serially diluted 1:5 in DMSO to yield 2000, 400, 80, 16, 3.2, 0.64, 0.128, ...
US Patent US11021463 (2021)
Mitogen-activated protein kinase kinase kinase kinase 1
(Homo sapiens (Human))
BDBM283445
(N-((6-amino-2-methylpyridin-3-yl)methyl)-2- ((3-ch...)
Show SMILES Cc1nc(N)ccc1CNC(=O)c1ccnc(Cc2cc(CO)c3ncc(Cl)cc3c2)c1
Show InChI InChI=1S/C24H22ClN5O2/c1-14-17(2-3-22(26)30-14)11-29-24(32)16-4-5-27-21(10-16)8-15-6-18-9-20(25)12-28-23(18)19(7-15)13-31/h2-7,9-10,12,31H,8,11,13H2,1H3,(H2,26,30)(H,29,32)
NCI pathway
US Patent
n/an/a<100n/an/an/an/an/an/a
Vitae Pharmaceuticals
Assay Description
A 10 mM solution of the test compound was made in DMSO. This solution was serially diluted 1:5 in DMSO to yield 2000, 400, 80, 16, 3.2, 0.64, 0.128, ...
Bioorg Med Chem Lett 19: 3541-5 (2009)
BindingDB Entry DOI: 10.7270/Q25141K2
Plasma kallikrein
(Homo sapiens (Human))
BDBM283445
(N-((6-amino-2-methylpyridin-3-yl)methyl)-2- ((3-ch...)
Show SMILES Cc1nc(N)ccc1CNC(=O)c1ccnc(Cc2cc(CO)c3ncc(Cl)cc3c2)c1
Show InChI InChI=1S/C24H22ClN5O2/c1-14-17(2-3-22(26)30-14)11-29-24(32)16-4-5-27-21(10-16)8-15-6-18-9-20(25)12-28-23(18)19(7-15)13-31/h2-7,9-10,12,31H,8,11,13H2,1H3,(H2,26,30)(H,29,32)
US Patent
n/an/a<100n/an/an/an/an/an/a
ENSCMu
Assay Description
A 10 mM solution of the test compound was made in DMSO. This solution was serially diluted 1:5 in DMSO to yield 2000, 400, 80, 16, 3.2, 0.64, 0.128, ...
Bioorg Med Chem 14: 7241-57 (2006)
BindingDB Entry DOI: 10.7270/Q2J968P7
Plasma kallikrein
(Homo sapiens (Human))
BDBM283445
(N-((6-amino-2-methylpyridin-3-yl)methyl)-2- ((3-ch...)
Show SMILES Cc1nc(N)ccc1CNC(=O)c1ccnc(Cc2cc(CO)c3ncc(Cl)cc3c2)c1
Show InChI InChI=1S/C24H22ClN5O2/c1-14-17(2-3-22(26)30-14)11-29-24(32)16-4-5-27-21(10-16)8-15-6-18-9-20(25)12-28-23(18)19(7-15)13-31/h2-7,9-10,12,31H,8,11,13H2,1H3,(H2,26,30)(H,29,32)
US Patent
n/an/a<100n/an/an/an/an/an/a
LIFESCI PHARMACEUTICALS, INC.
US Patent
Assay Description
The ability of the compounds disclosed herein to inhibit human plasma kallikrein activity was quantified according to the procedures below.A 10 mM so...
US Patent US9611252 (2017)
BindingDB Entry DOI: 10.7270/Q2930W8S