BDBM28389 1-[4-(dimethylamino)phenyl]-3-[4-({4-oxo-2H,4H,5H-pyrazolo[3,4-d]pyrimidin-2-yl}methyl)phenyl]urea::pyrazolo[3,4-d]pyrimidin-4-one, 14e
SMILES: CN(C)c1ccc(NC(=O)Nc2ccc(Cn3cc4c(n3)nc[nH]c4=O)cc2)cc1
InChI Key: InChIKey=VCYINKPTIDWUAH-UHFFFAOYSA-N
Data: 1 KI
Activity Spreadsheet -- Enzyme Inhibition Constant Data from BindingDB
Found 1 hit for monomerid = 28389
Trg + Lig
Ki
nM
ΔG°
kcal/mole
IC50
nM
Kd
nM
EC50/IC50
nM
koff
s-1
kon
M-1s-1
pHTemp
°C
Adenosine deaminase
(Bos taurus (bovine))
BDBM28389
(1-[4-(dimethylamino)phenyl]-3-[4-({4-oxo-2H,4H,5H-...)
Show SMILES CN(C)c1ccc(NC(=O)Nc2ccc(Cn3cc4c(n3)nc[nH]c4=O)cc2)cc1
Show InChI InChI=1S/C21H21N7O2/c1-27(2)17-9-7-16(8-10-17)25-21(30)24-15-5-3-14(4-6-15)11-28-12-18-19(26-28)22-13-23-20(18)29/h3-10,12-13H,11H2,1-2H3,(H2,24,25,30)(H,22,23,26,29)
2.01E+3 -7.90n/an/an/an/an/a7.230
Universita di Pisa
Assay Description
The activity of ADA was determined spectrophotometrically by monitoring the change in absorbance at 262 nm, due to the deamination of adenosine catal...
J Med Chem 52: 1681-92 (2009)
Article DOI: 10.1021/jm801427r
BindingDB Entry DOI: 10.7270/Q29K48J8