BDBM28418 (2E)-3-(3-{6-[(4-aminocyclohexyl)amino]pyrazin-2-yl}phenyl)prop-2-enoic acid::pyrazine inhibitor, 24
SMILES: N[C@H]1CC[C@H](CC1)Nc1cncc(n1)-c1cccc(\C=C\C(O)=O)c1
InChI Key: InChIKey=GPICQYUBSFLTRN-CQTVFXNMSA-N
Data: 1 IC50
PDB links: 1 PDB ID matches this monomer.
Activity Spreadsheet -- Enzyme Inhibition Constant Data from BindingDB
Found 1 hit for monomerid = 28418
Trg + Lig
Ki
nM
ΔG°
kcal/mole
IC50
nM
Kd
nM
EC50/IC50
nM
koff
s-1
kon
M-1s-1
pHTemp
°C
Serine/threonine-protein kinase pim-2
(Homo sapiens (Human))
BDBM28418
((2E)-3-(3-{6-[(4-aminocyclohexyl)amino]pyrazin-2-y...)
Show SMILES N[C@H]1CC[C@H](CC1)Nc1cncc(n1)-c1cccc(\C=C\C(O)=O)c1 |r,wD:4.7,1.0,(-2.78,-3.68,;-2.78,-2.14,;-1.45,-1.37,;-1.45,.17,;-2.78,.94,;-4.12,.17,;-4.12,-1.37,;-2.78,2.48,;-1.45,3.25,;-1.45,4.8,;-.12,5.57,;1.22,4.8,;1.22,3.25,;-.12,2.48,;2.55,2.48,;3.88,3.26,;5.22,2.48,;5.22,.94,;3.88,.17,;3.88,-1.37,;5.22,-2.14,;5.22,-3.68,;6.55,-4.45,;3.88,-4.45,;2.55,.94,)|
Show InChI InChI=1S/C19H22N4O2/c20-15-5-7-16(8-6-15)22-18-12-21-11-17(23-18)14-3-1-2-13(10-14)4-9-19(24)25/h1-4,9-12,15-16H,5-8,20H2,(H,22,23)(H,24,25)/b9-4+/t15-,16+
n/an/a 19n/an/an/an/an/an/a
Boehringer Ingelheim Pharmaceuticals Inc.
Assay Description
The activity of Pim kinase was measured in a homogeneous luciferase assay using GST-Pim, biotinylated peptide substrate and a luciferin-luciferase de...
J Med Chem 52: 1814-27 (2009)
Article DOI: 10.1021/jm801242y
BindingDB Entry DOI: 10.7270/Q25T3HS3