BDBM28434 2-({[(2R,3S,4R,5R)-5-(6-amino-8-methyl-9H-purin-9-yl)-3,4-dihydroxyoxolan-2-yl]methyl}(methyl)amino)acetamide::AdoMet substrate analogue, 17f
SMILES: CN(C[C@H]1O[C@H]([C@H](O)[C@@H]1O)n1c(C)nc2c(N)ncnc12)CC(N)=O
InChI Key: InChIKey=IRWBMXVMEDHEJW-FRJWGUMJSA-N
Data: 1 Other
PDB links: 1 PDB ID matches this monomer.
Activity Spreadsheet -- Enzyme Inhibition Constant Data from BindingDB
Found 1 hit for monomerid = 28434
Trg + Lig
Ki
nM
ΔG°
kcal/mole
IC50
nM
Kd
nM
EC50/IC50
nM
koff
s-1
kon
M-1s-1
pHTemp
°C
S-adenosylmethionine decarboxylase 1
(Homo sapiens (Human))
BDBM28434
(2-({[(2R,3S,4R,5R)-5-(6-amino-8-methyl-9H-purin-9-...)
Show SMILES CN(C[C@H]1O[C@H]([C@H](O)[C@@H]1O)n1c(C)nc2c(N)ncnc12)CC(N)=O
Show InChI InChI=1S/C14H21N7O4/c1-6-19-9-12(16)17-5-18-13(9)21(6)14-11(24)10(23)7(25-14)3-20(2)4-8(15)22/h5,7,10-11,14,23-24H,3-4H2,1-2H3,(H2,15,22)(H2,16,17,18)/t7-,10-,11-,14-/m1/s1
Reactome pathway
n/an/an/an/an/an/an/a6.822
Cornell University
Assay Description
The C-terminal his-tagged AdoMetDC was assayed by measuring the release of 14CO2 from S-adenosyl-L-[carboxy-14C]methionine (Amersham Pharmacia Biotec...
J Med Chem 52: 1388-407 (2009)
Article DOI: 10.1021/jm801126a
BindingDB Entry DOI: 10.7270/Q2222S3J
3D
3D Structure (crystal)