BDBM28519 (3R,5S)-5-{2-[4-({3-chloro-4-[(3-fluorophenyl)methoxy]phenyl}amino)thieno[3,2-d]pyrimidin-6-yl]ethynyl}pyrrolidin-3-yl N-(2-methanesulfonylethyl)carbamate::pyrrolidinyl-acetylenic thieno[3,2-d]pyrimidine, 6j
SMILES: CS(=O)(=O)CCNC(=O)O[C@H]1CN[C@@H](C1)C#Cc1cc2ncnc(Nc3ccc(OCc4cccc(F)c4)c(Cl)c3)c2s1
InChI Key: InChIKey=NWDMCJXGXJGDKM-IFMALSPDSA-N
Data: 2 IC50
Activity Spreadsheet -- Enzyme Inhibition Constant Data from BindingDB
Found 2 hits for monomerid = 28519
Trg + Lig
Ki
nM
ΔG°
kcal/mole
IC50
nM
Kd
nM
EC50/IC50
nM
koff
s-1
kon
M-1s-1
pHTemp
°C
Receptor tyrosine-protein kinase erbB-2
(Homo sapiens (Human))
BDBM28519
((3R,5S)-5-{2-[4-({3-chloro-4-[(3-fluorophenyl)meth...)
Show SMILES CS(=O)(=O)CCNC(=O)O[C@H]1CN[C@@H](C1)C#Cc1cc2ncnc(Nc3ccc(OCc4cccc(F)c4)c(Cl)c3)c2s1 |r|
Show InChI InChI=1S/C29H27ClFN5O5S2/c1-43(38,39)10-9-32-29(37)41-22-12-20(33-15-22)5-7-23-14-25-27(42-23)28(35-17-34-25)36-21-6-8-26(24(30)13-21)40-16-18-3-2-4-19(31)11-18/h2-4,6,8,11,13-14,17,20,22,33H,9-10,12,15-16H2,1H3,(H,32,37)(H,34,35,36)/t20-,22-/m1/s1
n/an/a 32n/an/an/an/an/an/a
GSK
Assay Description
Assays were performed in 96-well polystyrene round-bottomed plates in reaction buffer containing biotinylated substrate and purified kinase in the pr...
Bioorg Med Chem Lett 19: 21-6 (2009)
Article DOI: 10.1016/j.bmcl.2008.11.023
BindingDB Entry DOI: 10.7270/Q2NV9GKZ
Epidermal growth factor receptor
(Homo sapiens (Human))
BDBM28519
((3R,5S)-5-{2-[4-({3-chloro-4-[(3-fluorophenyl)meth...)
Show SMILES CS(=O)(=O)CCNC(=O)O[C@H]1CN[C@@H](C1)C#Cc1cc2ncnc(Nc3ccc(OCc4cccc(F)c4)c(Cl)c3)c2s1 |r|
Show InChI InChI=1S/C29H27ClFN5O5S2/c1-43(38,39)10-9-32-29(37)41-22-12-20(33-15-22)5-7-23-14-25-27(42-23)28(35-17-34-25)36-21-6-8-26(24(30)13-21)40-16-18-3-2-4-19(31)11-18/h2-4,6,8,11,13-14,17,20,22,33H,9-10,12,15-16H2,1H3,(H,32,37)(H,34,35,36)/t20-,22-/m1/s1
n/an/a 40n/an/an/an/a7.523
GSK
Assay Description
Assays were performed in 96-well polystyrene round-bottomed plates in reaction buffer containing biotinylated substrate and purified kinase in the pr...
Bioorg Med Chem Lett 19: 21-6 (2009)
Article DOI: 10.1016/j.bmcl.2008.11.023
BindingDB Entry DOI: 10.7270/Q2NV9GKZ