BDBM28521 (3S,5R)-5-{2-[4-({3-chloro-4-[(3-fluorophenyl)methoxy]phenyl}amino)thieno[3,2-d]pyrimidin-6-yl]ethynyl}pyrrolidin-3-yl N,N-dimethylcarbamate::pyrrolidinyl-acetylenic thieno[3,2-d]pyrimidine, 15
SMILES: CN(C)C(=O)O[C@@H]1CN[C@H](C1)C#Cc1cc2ncnc(Nc3ccc(OCc4cccc(F)c4)c(Cl)c3)c2s1
InChI Key: InChIKey=YEIAMNOHYKXSFB-FPOVZHCZSA-N
Data: 2 IC50
Activity Spreadsheet -- Enzyme Inhibition Constant Data from BindingDB
Found 2 hits for monomerid = 28521
Trg + Lig
Ki
nM
ΔG°
kcal/mole
IC50
nM
Kd
nM
EC50/IC50
nM
koff
s-1
kon
M-1s-1
pHTemp
°C
Receptor tyrosine-protein kinase erbB-2
(Homo sapiens (Human))
BDBM28521
((3S,5R)-5-{2-[4-({3-chloro-4-[(3-fluorophenyl)meth...)
Show SMILES CN(C)C(=O)O[C@@H]1CN[C@H](C1)C#Cc1cc2ncnc(Nc3ccc(OCc4cccc(F)c4)c(Cl)c3)c2s1 |r|
Show InChI InChI=1S/C28H25ClFN5O3S/c1-35(2)28(36)38-21-11-19(31-14-21)6-8-22-13-24-26(39-22)27(33-16-32-24)34-20-7-9-25(23(29)12-20)37-15-17-4-3-5-18(30)10-17/h3-5,7,9-10,12-13,16,19,21,31H,11,14-15H2,1-2H3,(H,32,33,34)/t19-,21-/m0/s1
n/an/a 40n/an/an/an/an/an/a
GSK
Assay Description
Assays were performed in 96-well polystyrene round-bottomed plates in reaction buffer containing biotinylated substrate and purified kinase in the pr...
Bioorg Med Chem Lett 19: 21-6 (2009)
Article DOI: 10.1016/j.bmcl.2008.11.023
BindingDB Entry DOI: 10.7270/Q2NV9GKZ
Epidermal growth factor receptor
(Homo sapiens (Human))
BDBM28521
((3S,5R)-5-{2-[4-({3-chloro-4-[(3-fluorophenyl)meth...)
Show SMILES CN(C)C(=O)O[C@@H]1CN[C@H](C1)C#Cc1cc2ncnc(Nc3ccc(OCc4cccc(F)c4)c(Cl)c3)c2s1 |r|
Show InChI InChI=1S/C28H25ClFN5O3S/c1-35(2)28(36)38-21-11-19(31-14-21)6-8-22-13-24-26(39-22)27(33-16-32-24)34-20-7-9-25(23(29)12-20)37-15-17-4-3-5-18(30)10-17/h3-5,7,9-10,12-13,16,19,21,31H,11,14-15H2,1-2H3,(H,32,33,34)/t19-,21-/m0/s1
n/an/a 40n/an/an/an/a7.523
GSK
Assay Description
Assays were performed in 96-well polystyrene round-bottomed plates in reaction buffer containing biotinylated substrate and purified kinase in the pr...
Bioorg Med Chem Lett 19: 21-6 (2009)
Article DOI: 10.1016/j.bmcl.2008.11.023
BindingDB Entry DOI: 10.7270/Q2NV9GKZ