BDBM285742 US10080744, Example 3/9
SMILES: C[C@H](NS(=O)(=O)c1ccc(-c2sc(nc2CC2CCC2)-c2nnc(CC(C)(C)OC=O)o2)c(Cl)c1Cl)C(F)(F)F
InChI Key: InChIKey=UMDJHLBJPVRSDW-LBPRGKRZSA-N
Data: 1 IC50  1 Kd
Activity Spreadsheet -- Enzyme Inhibition Constant Data from BindingDB
Found 2 hits for monomerid = 285742
Trg + Lig
Ki
nM
ΔG°
kcal/mole
IC50
nM
Kd
nM
EC50/IC50
nM
koff
s-1
kon
M-1s-1
pHTemp
°C
Nuclear receptor ROR-gamma (RORC)
(Homo sapiens (Human))
BDBM285742
(US10080744, Example 3/9)
Show SMILES C[C@H](NS(=O)(=O)c1ccc(-c2sc(nc2CC2CCC2)-c2nnc(CC(C)(C)OC=O)o2)c(Cl)c1Cl)C(F)(F)F |r|
Show InChI InChI=1S/C24H25Cl2F3N4O5S2/c1-12(24(27,28)29)33-40(35,36)16-8-7-14(18(25)19(16)26)20-15(9-13-5-4-6-13)30-22(39-20)21-32-31-17(38-21)10-23(2,3)37-11-34/h7-8,11-13,33H,4-6,9-10H2,1-3H3/t12-/m0/s1
US Patent
n/an/a 4.30n/an/an/an/an/an/a
Janssen Pharmaceutica NV
US Patent
Assay Description
Cells used in this assay were transiently co-transfected with three different plasmids, one expressing the GAL4-DNA binding domain (DBD)-RORγt f...
US Patent US10080744 (2018)
BindingDB Entry DOI: 10.7270/Q21J9CVM
Nuclear receptor ROR-gamma (RORC)
(Homo sapiens (Human))
BDBM285742
(US10080744, Example 3/9)
Show SMILES C[C@H](NS(=O)(=O)c1ccc(-c2sc(nc2CC2CCC2)-c2nnc(CC(C)(C)OC=O)o2)c(Cl)c1Cl)C(F)(F)F |r|
Show InChI InChI=1S/C24H25Cl2F3N4O5S2/c1-12(24(27,28)29)33-40(35,36)16-8-7-14(18(25)19(16)26)20-15(9-13-5-4-6-13)30-22(39-20)21-32-31-17(38-21)10-23(2,3)37-11-34/h7-8,11-13,33H,4-6,9-10H2,1-3H3/t12-/m0/s1
US Patent
n/an/an/a 0.360n/an/an/an/an/a
Janssen Pharmaceutica NV
US Patent
Assay Description
For the RORγt construct used in the ThermoFluor assay, numbering for the nucleotide sequences was based on the reference sequence for human ROR&...
US Patent US10080744 (2018)
BindingDB Entry DOI: 10.7270/Q21J9CVM