BDBM285762 US10080744, Example 3/29
SMILES: C[C@H](NS(=O)(=O)c1ccc(-c2sc(nc2CC2CC(C)(C)C2)-c2nnc(CC(C)(C)C(O)=O)o2)c(Cl)c1Cl)C(F)(F)F
InChI Key: InChIKey=MLEWUHYVMOXLSD-LBPRGKRZSA-N
Data: 1 IC50  1 Kd
Activity Spreadsheet -- Enzyme Inhibition Constant Data from BindingDB
Found 2 hits for monomerid = 285762
Trg + Lig
Ki
nM
ΔG°
kcal/mole
IC50
nM
Kd
nM
EC50/IC50
nM
koff
s-1
kon
M-1s-1
pHTemp
°C
Nuclear receptor ROR-gamma (RORC)
(Homo sapiens (Human))
BDBM285762
(US10080744, Example 3/29)
Show SMILES C[C@H](NS(=O)(=O)c1ccc(-c2sc(nc2CC2CC(C)(C)C2)-c2nnc(CC(C)(C)C(O)=O)o2)c(Cl)c1Cl)C(F)(F)F |r|
Show InChI InChI=1S/C26H29Cl2F3N4O5S2/c1-12(26(29,30)31)35-42(38,39)16-7-6-14(18(27)19(16)28)20-15(8-13-9-24(2,3)10-13)32-22(41-20)21-34-33-17(40-21)11-25(4,5)23(36)37/h6-7,12-13,35H,8-11H2,1-5H3,(H,36,37)/t12-/m0/s1
US Patent
n/an/a 2.90n/an/an/an/an/an/a
Janssen Pharmaceutica NV
US Patent
Assay Description
Cells used in this assay were transiently co-transfected with three different plasmids, one expressing the GAL4-DNA binding domain (DBD)-RORγt f...
US Patent US10080744 (2018)
BindingDB Entry DOI: 10.7270/Q21J9CVM
Nuclear receptor ROR-gamma (RORC)
(Homo sapiens (Human))
BDBM285762
(US10080744, Example 3/29)
Show SMILES C[C@H](NS(=O)(=O)c1ccc(-c2sc(nc2CC2CC(C)(C)C2)-c2nnc(CC(C)(C)C(O)=O)o2)c(Cl)c1Cl)C(F)(F)F |r|
Show InChI InChI=1S/C26H29Cl2F3N4O5S2/c1-12(26(29,30)31)35-42(38,39)16-7-6-14(18(27)19(16)28)20-15(8-13-9-24(2,3)10-13)32-22(41-20)21-34-33-17(40-21)11-25(4,5)23(36)37/h6-7,12-13,35H,8-11H2,1-5H3,(H,36,37)/t12-/m0/s1
US Patent
n/an/an/a 0.0830n/an/an/an/an/a
Janssen Pharmaceutica NV
US Patent
Assay Description
For the RORγt construct used in the ThermoFluor assay, numbering for the nucleotide sequences was based on the reference sequence for human ROR&...
US Patent US10080744 (2018)
BindingDB Entry DOI: 10.7270/Q21J9CVM