null
SMILES: CC[C@H](NS(=O)(=O)c1ccc(-c2sc(nc2CC2(CCC2)OC)-c2noc(CC(C)(C)OC=O)n2)c(Cl)c1Cl)C(F)(F)F
InChI Key: InChIKey=PVDSGYZYGNRTME-KRWDZBQOSA-N
Activity Spreadsheet -- Enzyme Inhibition Constant Data from BindingDB
Found 2 hits for monomerid = 285799
Trg + Lig
Ki
nM
ΔG°
kcal/mole
IC50
nM
Kd
nM
EC50/IC50
nM
koff
s-1
kon
M-1s-1
pHTemp
°C
Nuclear receptor ROR-gamma
(Homo sapiens (Human))
BDBM285799
(US10080744, Example 11/10)
Show SMILES CC[C@H](NS(=O)(=O)c1ccc(-c2sc(nc2CC2(CCC2)OC)-c2noc(CC(C)(C)OC=O)n2)c(Cl)c1Cl)C(F)(F)F |r|
Show InChI InChI=1S/C26H29Cl2F3N4O6S2/c1-5-17(26(29,30)31)35-43(37,38)16-8-7-14(19(27)20(16)28)21-15(11-25(39-4)9-6-10-25)32-23(42-21)22-33-18(41-34-22)12-24(2,3)40-13-36/h7-8,13,17,35H,5-6,9-12H2,1-4H3/t17-/m0/s1
US Patent
n/an/a 3.20n/an/an/an/an/an/a
Janssen Pharmaceutica NV
US Patent
Assay Description
Cells used in this assay were transiently co-transfected with three different plasmids, one expressing the GAL4-DNA binding domain (DBD)-RORγt f...
US Patent US10080744 (2018)
BindingDB Entry DOI: 10.7270/Q21J9CVM
Nuclear receptor ROR-gamma
(Homo sapiens (Human))
BDBM285799
(US10080744, Example 11/10)
Show SMILES CC[C@H](NS(=O)(=O)c1ccc(-c2sc(nc2CC2(CCC2)OC)-c2noc(CC(C)(C)OC=O)n2)c(Cl)c1Cl)C(F)(F)F |r|
Show InChI InChI=1S/C26H29Cl2F3N4O6S2/c1-5-17(26(29,30)31)35-43(37,38)16-8-7-14(19(27)20(16)28)21-15(11-25(39-4)9-6-10-25)32-23(42-21)22-33-18(41-34-22)12-24(2,3)40-13-36/h7-8,13,17,35H,5-6,9-12H2,1-4H3/t17-/m0/s1
US Patent
n/an/an/a 0.230n/an/an/an/an/a
Janssen Pharmaceutica NV
US Patent
Assay Description
For the RORγt construct used in the ThermoFluor assay, numbering for the nucleotide sequences was based on the reference sequence for human ROR&...
US Patent US10080744 (2018)
BindingDB Entry DOI: 10.7270/Q21J9CVM